{"text_format":"1","workbook":"xlsx","n_sheets":22,"sheets":["Disclaimer","Instructions","Summary","Configure System","Configure Module 1","Configure Module 2","Configure Module 3","Configure Module 4","Serverboard","Chassis Definition","Processors","Memory","PCI","HSBP","HardDrive","Peripherals","Taylor Pass_Normal","Taylor Pass_Fan Fail","Buchanan Pass_Normal","Buchanan Pass_Fan Fail","Revision","Macro1"],"not_rendered":{"charts":0,"images":1,"macros":1,"external_links":3,"defined_names":427,"comments":1,"pivot_tables":0},"unopened":[],"bounds":{"document_bytes":16777216,"sheet_cells":100000,"rows_first":2000,"rows_last":500,"rows_between":2000,"halvings":0,"cell_chars":16384,"cell_head_chars":4096},"cells_cut":0,"cells_raw":0,"read":"whole","date_system":"1900"}

{"sheet":"Disclaimer","index":0,"n_rows":0,"n_cols":0,"rows_kept":0,"cut":false,"hidden":false,"merged":[]}

{"sheet":"Instructions","index":1,"n_rows":40,"n_cols":1,"rows_kept":40,"cut":false,"hidden":false,"merged":[]}
["        Power Budget Instructions"]
[]
[]
[]
[]
[]
[]
[]
[]
[]
[]
[]
[]
[]
[]
[]
[]
[]
[]
[]
[]
[]
[]
[]
[]
[]
[]
[]
[]
[]
[]
[]
[]
[]
[]
[]
[]
[]
[]
["Press the Start button to begin using the Power Budget Tool"]

{"sheet":"Summary","index":2,"n_rows":31,"n_cols":15,"rows_kept":31,"cut":false,"hidden":false,"merged":[[0,1,0,3],[16,0,16,3],[25,11,27,11],[28,11,30,11],[6,8,6,9]]}
["Power Budget",null,null,null,null,null,null,"Product Code Summary"]
["Chassis / Power Supply",{"$f":"INDEX('Chassis Definition'!$A$3:$A$9,'Configure System'!B3)","v":"(Select Chassis)"},null,null,null,null,null,"H2312KPKR2","H2312KPFKR2","H2312TPKR2","H2312TPFKR2"]
["System Totals"," 12V\nMain\n(Amps)","12V\nStby\n(Amps)","Total System Watts ",null,null,null,"H2216KPKR2","H2216KPFKR2","H2216TPKR2","H2216TPFKR2"]
[{"$f":"CONCATENATE(\"Compute Module 1: \",INDEX(Serverboard!A$2:A$13,'Configure Module 1'!B3))","v":"Compute Module 1: (Select Serverboard)"},{"$f":"'Configure Module 1'!$K$17","v":0},{"$f":"'Configure Module 1'!$L$17","v":0},{"$f":"'Configure Module 1'!$M$17","v":0},null,null,null,"H2224KPKR2(1600W)",null,"H2224TPKR2(1600W)"]
[{"$f":"CONCATENATE(\"Compute Module 2: \",INDEX(Serverboard!A$2:A$13,'Configure Module 2'!B3))","v":"Compute Module 2: (Select Serverboard)"},{"$f":"'Configure Module 2'!$K$17","v":0},{"$f":"'Configure Module 2'!$L$17","v":0},{"$f":"'Configure Module 2'!$M$17","v":0},null,null,null,"H2224KPKR2(2200W)",null,"H2224TPKR2(2200W)"]
[{"$f":"CONCATENATE(\"Compute Module 3: \",INDEX(Serverboard!A$2:A$13,'Configure Module 3'!B3))","v":"Compute Module 3: (Select Serverboard)"},{"$f":"'Configure Module 3'!$K$17","v":0},{"$f":"'Configure Module 3'!$L$17","v":0},{"$f":"'Configure Module 3'!$M$17","v":0}]
[{"$f":"CONCATENATE(\"Compute Module 4: \",INDEX(Serverboard!A$2:A$13,'Configure Module 4'!B3))","v":"Compute Module 4: (Select Serverboard)"},{"$f":"'Configure Module 4'!$K$17","v":0},{"$f":"'Configure Module 4'!$L$17","v":0},{"$f":"'Configure Module 4'!$M$17","v":0},null,null,null,null,"PSU Limitation"]
["Hard Drive:",{"$f":"SUM('Configure System'!G5:G11)","v":0},{"$f":"SUM('Configure System'!H5:H11)","v":0},{"$f":"SUM('Configure System'!I5:I11)","v":0},null,null,null,"  ",0,0]
["Chassis & Peripherals:",{"$f":"'Configure System'!G3","v":0},{"$f":"'Configure System'!H3","v":0},{"$f":"'Configure System'!I3","v":0},null,null,null,"H2312KR/2x1600W CRPS/3x4056 dual rotor fan",{"$f":"IF(B20=1,1600,1000)","v":1600},{"$f":"IF(B20=1,2160,1360)","v":2160}]
["System Totals:",{"$f":"SUM(B4:B9)","v":0},{"$f":"SUM(C4:C9)","v":0},{"$f":"SUM(D4:D9)","v":0},null,null,null,"H2216KR/2x1600W CRPS/3x4056 dual rotor fan",{"$f":"IF(B20=1,1600,1000)","v":1600},{"$f":"IF(B20=1,2160,1360)","v":2160}]
["CLST Allowance",{"$f":"'Configure Module 1'!K18+'Configure Module 2'!K18+'Configure Module 3'!K18+'Configure Module 4'!K18","v":0},{"$f":"'Configure Module 1'!L18+'Configure Module 2'!L18+'Configure Module 3'!L18+'Configure Module 4'!L18","v":0},{"$f":"B11*12","v":0},null,null,null,"H2224KPKR2(1600W)  CRPS/3x4056 dual rotor fan"]
["System Power during CLST",{"$f":"B10-B11","v":0},{"$f":"C10-C11","v":0},{"$f":"D10-D11","v":0},null,null,null,"H2224KPKR2(2200W)  CRPS/3x4056 dual rotor fan"]
[{"$f":"INDEX(H20:H21,B20)&\"VAC\"&\" PSU DC Output Limits (2+0 Mode)\"","v":"220VAC PSU DC Output Limits (2+0 Mode)"},{"$f":"INDEX('Chassis Definition'!D3:E11,'Configure System'!B3,B20)*2","v":0},{"$f":"INDEX('Chassis Definition'!F3:F11,'Configure System'!B3)*2","v":0},{"$f":"PS1_12*12","v":0},"<-- These limits may change based on inlet voltage",null,null,"PSU","Rating","OC CLST"]
[{"$f":"INDEX(H20:H21,B20)&\"VAC\"&\" PSU DC Output Limits (1+1 Mode)\"","v":"220VAC PSU DC Output Limits (1+1 Mode)"},{"$f":"INDEX('Chassis Definition'!D3:E11,'Configure System'!B3,B20)*1","v":0},{"$f":"INDEX('Chassis Definition'!F3:F11,'Configure System'!B3)*1","v":0},{"$f":"B14*12","v":0},null,null,null,{"$f":"INDEX(I8:J12,'Configure System'!B3,1)","v":0},{"$f":"INDEX(I8:J12,'Configure System'!B3,1)","v":0},{"$f":"INDEX(I8:J12,'Configure System'!B3,2)","v":0}]
["Margins to Limit (2+0 Mode)",{"$f":"PS1_12-B10","v":0},{"$f":"PS1_5VSB-C10","v":0},{"$f":"ps1CombLim-PowerTotal","v":0},{"$f":"IF(D15<0,\"<-- Limits Exceeded!\",\"<--System Margins\")","v":"<--System Margins"},null,null,null,{"$f":"I14-PowerTotal","v":0},{"$f":"J14-PowerTotal","v":0}]
["Margins to Limit (1+1 Mode)",{"$f":"B14-B10","v":0},{"$f":"C14-C10","v":0},{"$f":"D14-PowerTotal","v":0},null,null,null,null,"Unconstrained Redundant Mode: No system throttle.  All 4 nodes work normally.","Optimal Redundant Mode:\n1. With BIOS setting “server management - shutdown policy”  “disable”, all nodes in the system may be throttled and have lower performance.\n2. With BIOS “server management--shutdown policy” “enable”, Node3 and 4 will shutdown while Node1 and 2 keep running without throttling. Node 1 and Node 2 have no performance lose.","Non Redundant Mode: All nodes in the  system may shutdown due to OCP."]
["Negative margins show configuration exceeds a specified limit."]
[]
["AC inlet power estimate (below)"]
["Input Voltage:",1," (Volts)",null,null,null,null,220,{"$f":"INDEX('Chassis Definition'!N4:O11,'Configure System'!B3-1,Summary!B20)","v":{"$error":"#VALUE!"}}]
["Estimated  Inlet Power:",{"$f":"IF(D15>0,PowerTotal/INDEX('Chassis Definition'!N4:O11,'Configure System'!B3-1,Summary!B20),\"NA\")","v":"NA"}," (Watts)",null,null,null,null,115]
["Estimated Inlet Current:",{"$f":"IF(B21=\"NA\",\"NA\",B21/ABS(INDEX(H20:H23,B20)))","v":"NA"}," (Amps)"]
["Estimated Thermal Dissipation:",{"$f":"IF(B21=\"NA\",\"NA\",B21*3.41)","v":"NA"}," (BTU/Hr)"]
["Note: Estimates are most accurate at max loading."]
[null,null,null,null,null,null,null,null,null,null,null,"PSU","System Loading","Working Mode\n@1 PSU failure","Description"]
[null,null,null,null,null,null,null,null,null,null,null,null,"<Rating","Unconstrained Redundant Mode","No system throttle.  All 4 nodes work normally."]
["If your desired configuration exceeds the power supply limits, two power supplies are required.  The two power supplies will operate in a current sharing mode ",null,null,null,null,null,null,null,null,null,null,null,"Rating< <OC CLST","Optimal Redundant Mode","1. With BIOS setting “server management - shutdown policy”  “disable”, all   nodes  in the system may be  throttled  and have lower performance.\n2. With BIOS “server management--shutdown policy” “enable”, Node3 and 4  will shutdown  while Node1 and 2 keep running without  throttling. Node 1 and Node 2 have no performance lose. "]
["to deliver the additional power needed for your configuration.  Furthermore, the two power supplies may need to be sourced from separate AC circuits in order to not",null,null,null,null,null,null,null,null,null,null,null,">OC CLST","Non Redundant Mode","All nodes in the  system may shutdown due to OCP."]
["exceed maximum AC outlet current.  Exceeding maximum AC outlet current may cause a circuit breaker to trip."]
[]
["Revision:",{"$f":"Revision!B1","v":1},{"$f":"Revision!A1","v":"2019-04-15"}]

{"sheet":"Configure System","index":3,"n_rows":14,"n_cols":19,"rows_kept":14,"cut":false,"hidden":false,"merged":[]}
["Power Budget",{"$f":"CONCATENATE(INDEX('Chassis Definition'!$A$3:$A$12,B3), \" System Config\")","v":"(Select Chassis) System Config"},null,null,null,null,null,null,null,null,"HSBP 5V VRM Efficiency"]
["System Feature","Description","Qty",null,"+3.3V (amps)","+5V (amps)","12V\nMAIN\n(Amps)","12V \nStby (Amps)","Power\n(watts)",null,{"$f":"INDEX('Chassis Definition'!M$3:M$12,$B3)","v":1}]
["Chassis:",1,null,null,null,null,{"$f":"INDEX(HSBP!$D$2:$D$5,B3)","v":0},{"$f":"INDEX(HSBP!$E$2:$E$5,B3)","v":0},{"$f":"INDEX(HSBP!$G$2:$G$5,B3)","v":0},null,null,null,{"$f":"IF((B3<3)*(B3>1), \"<--Not support PCIe SSD\", \" \")","v":" "},null,{"$f":"B3","v":1},null,"  ","  ","  "]
["HSBP:",{"$f":"INDEX(HSBP!$A$2:$A$9,B3)","v":"Select Backplane or Midplane"},null,null,null,null,null,null,null,null,null,null,{"$f":"INDEX(Q3:Q6, $B3)","v":"  "},null,null,null,"<--Max 12 pcs Drives support","<--Max 3pcs Drives Support","<--Not Support PCIe SSD"]
["Module 1 Drive Type: ",1,0,null,null,{"$f":"INDEX(HardDrive!$C$2:$C$10,B5) *C5 * 1","v":0},{"$f":"IF(K2>0,(INDEX(HardDrive!$D$2:$D$10,B5)*C5+((F5*5)/12)/$K$2),INDEX(HardDrive!$D$2:$D$10,B5)*C5+((F5*5)/12)/#REF!)","v":0},0,{"$f":"G5*12","v":0},null,null,null,{"$f":"INDEX(R3:R6, $B3)","v":"  "},{"$f":"IF(D5>INDEX('Chassis Definition'!M3:M11,C3),\" <-- Max Supported HDD Count Exceeded!\",\" \")","v":" "},null,null,"<--Max 24 pcs 2.5\" Drives support","<--Max 6pcs 2.5\" Drives Support","<--Max 2pcs PCIe SSD Support"]
["Module 1 PCIe SSD: ",1,0,null,null,{"$f":"INDEX(HardDrive!$C$16:$C$21,B6) *C6 * 1","v":0},{"$f":"IF(K2>0,(INDEX(HardDrive!$D$16:$D$21,B6)*C6+((F6*5)/12)/$K$2),INDEX(HardDrive!$D$16:$D$21,B6)*C6+((F6*5)/12)/#REF!)","v":0},0,0,{"$f":"IF(C6>(INDEX('Chassis Definition'!$L$3:$L$12,'Configure System'!$B5)),\"<-- Max Supported HDD Count Exceeded!\",\" \")","v":" "},null,null,{"$f":"INDEX(S3:S6, $B3)","v":"  "},null,null,null,"<--Max 4 pcs 2.5\" SSD support","<--Max 1pcs 2.5\" SSD Support","<--Not Support PCIe SSD"]
["Module 2 Drive Type: ",1,0,null,null,{"$f":"INDEX(HardDrive!$C$2:$C$10,B7) *C7 * 1","v":0},{"$f":"IF(K2>0,(INDEX(HardDrive!$D$2:$D$10,B7)*C7+((F7*5)/12)/$K$2),INDEX(HardDrive!$D$2:$D$10,B7)*C7+((F7*5)/12)/#REF!)","v":0},0,0,{"$f":"IF((INDEX(Serverboard!$M$3:$M$9,'Configure System'!$B3)),\"<-- Max Supported HDD Count Exceeded!\",\" \")","v":" "},null,null,{"$f":"INDEX(R3:R6, $B3)","v":"  "}]
["Module 2 PCIe SSD: ",1,0,null,null,{"$f":"INDEX(HardDrive!$C$16:$C$21,B8) *C8 * 1","v":0},{"$f":"IF(K2>0,(INDEX(HardDrive!$D$16:$D$21,B8)*C8+((F8*5)/12)/$K$2),INDEX(HardDrive!$D$16:$D$21,B8)*C8+((F8*5)/12)/#REF!)","v":0},0,0,{"$f":"IF(C8>(INDEX('Chassis Definition'!$L$3:$L$12,'Configure System'!$B7)),\"<-- Max Supported HDD Count Exceeded!\",\" \")","v":" "},null,null,{"$f":"INDEX(S3:S6, $B3)","v":"  "}]
["Module 3 Drive Type: ",1,0,null,null,{"$f":"INDEX(HardDrive!$C$2:$C$10,B9) *C9 * 1","v":0},{"$f":"IF(K2>0,(INDEX(HardDrive!$D$2:$D$10,B9)*C9+((F9*5)/12)/$K$2),INDEX(HardDrive!$D$2:$D$10,B9)*C9+((F9*5)/12)/#REF!)","v":0},0,0,{"$f":"IF(C9>(INDEX('Chassis Definition'!$L$3:$L$12,'Configure System'!$B3)),\"<-- Max Supported HDD Count Exceeded!\",\" \")","v":" "},null,null,{"$f":"INDEX(R3:R6, $B3)","v":"  "}]
["Module 3 PCIe SSD: ",1,0,null,null,{"$f":"INDEX(HardDrive!$C$16:$C$21,B10) *C10 * 1","v":0},{"$f":"IF(K2>0,(INDEX(HardDrive!$D$16:$D$21,B10)*C10+((F10*5)/12)/$K$2),INDEX(HardDrive!$D$16:$D$21,B10)*C10+((F10*5)/12)/#REF!)","v":0},0,0,{"$f":"IF(C10>(INDEX('Chassis Definition'!$L$3:$L$12,'Configure System'!$B9)),\"<-- Max Supported HDD Count Exceeded!\",\" \")","v":" "},null,null,{"$f":"INDEX(S3:S6, $B3)","v":"  "}]
["Module 4 Drive Type: ",1,0,null,null,{"$f":"INDEX(HardDrive!$C$2:$C$10,B11) *C11 * 1","v":0},{"$f":"IF(K2>0,(INDEX(HardDrive!$D$2:$D$10,B11)*C11+((F11*5)/12)/$K$2),INDEX(HardDrive!$D$2:$D$10,B11)*C11+((F11*5)/12)/#REF!)","v":0},0,0,{"$f":"IF(C11>(INDEX('Chassis Definition'!$L$3:$L$12,'Configure System'!$B3)),\"<-- Max Supported HDD Count Exceeded!\",\" \")","v":" "},null,null,{"$f":"INDEX(R3:R6, $B3)","v":"  "}]
["Module 4 PCIe SSD: ",1,0,null,null,{"$f":"INDEX(HardDrive!$C$16:$C$21,B12) *C12 * 1","v":0},{"$f":"IF(K2>0,(INDEX(HardDrive!$D$16:$D$21,B12)*C12+((F12*5)/12)/$K$2),INDEX(HardDrive!$D$16:$D$21,B12)*C12+((F12*5)/12)/#REF!)","v":0},0,0,{"$f":"IF(C12>(INDEX('Chassis Definition'!$L$3:$L$12,'Configure System'!$B11)),\"<-- Max Supported HDD Count Exceeded!\",\" \")","v":" "},null,null,{"$f":"INDEX(S3:S6, $B3)","v":"  "}]
[null,"SubTotals:",null,null,null,{"$f":"SUM(F3:F11)","v":0},{"$f":"SUM(G3:G11)","v":0},{"$f":"SUM(H3:H11)","v":0},{"$f":"SUM(I3:I11)","v":0}]
[null,"SubTotal Chassis Power (Watts):",null,null,null,{"$f":"F13*5","v":0},{"$f":"G13*12","v":0},{"$f":"H13*12","v":0},{"$f":"SUM(E14:H14)","v":0}]

{"sheet":"Configure Module 1","index":4,"n_rows":18,"n_cols":18,"rows_kept":18,"cut":false,"hidden":false,"merged":[[0,1,0,12]]}
["Power Budget",{"$f":"CONCATENATE(\"Compute Module 1: \",INDEX(Serverboard!A$2:A$13,$B3),\" Configuration\")","v":"Compute Module 1: (Select Serverboard) Configuration"},null,null,null,null,null,null,null,null,null,null,null,null,"CPU VRM Efficiency","3.3v VRM Efficiency","5v VRM Efficiency"]
["Serverboard Feature","Description",null,"+3.3V (amps)","+5V (amps)"," +12V (amps)","12V CPU1 (amps)","12V CPU2 (amps)","5V \nstby (amps)","Max 3.3v/5v (watts)","12V\nMAIN\n(Amps)","12V\nStby\n(Amps)","Power (Watts)",null,{"$f":"INDEX(Serverboard!H$2:H$11,$B3)","v":1},{"$f":"INDEX(Serverboard!I$2:I$11,$B3)","v":1},{"$f":"INDEX(Serverboard!J$2:J$11,$B3)","v":1}]
["Computer Node:",1,null,{"$f":"INDEX(Serverboard!B$2:B$13,$B3) *1","v":0},{"$f":"INDEX(Serverboard!C$2:C$13,$B3) *1","v":0},{"$f":"INDEX(Serverboard!D$2:D$13,$B3) *1","v":0},null,null,{"$f":"INDEX(Serverboard!F$2:F$13,$B3) *1","v":0},null,{"$f":"F3+G3+H3","v":0},{"$f":"I3/0.87/12*5","v":0},{"$f":"INDEX(Serverboard!G$2:G$13,$B3) *1","v":0}]
["Processors 1:",1,null,null,null,null,{"$f":"(C5-1)*INDEX(Processors!B$2:B$60,$B4)/12/VRMefficiency","v":0},null,null,null,{"$f":"F4+G4+H4+I4","v":0},{"$f":"I4/0.87","v":0},{"$f":"K4*12","v":0},"*This line includes correction factors."]
[null,"Quantity:",1]
["Processors 2:",1,null,null,null,null,null,{"$f":"(C7-1)*INDEX(Processors!B$2:B$60,$B6)/12/VRMefficiency","v":0},null,null,{"$f":"F6+G6+H6+I6","v":0},{"$f":"I6/0.87","v":0},{"$f":"K6*12","v":0},"*This line includes correction factors."]
[null,"Quantity:",1]
[]
["System Fans:",{"$f":"IF((B3>1)*AND(B3<10),\"3 X 4056 dual rotor fan\",\"\")","v":""},null,null,null,{"$f":"IF(B9=\"\",0,6.3)","v":0},null,null,null,null,{"$f":"F9+G9+H9","v":0},{"$f":"I9/0.87/12","v":0},{"$f":"K9*12","v":0}]
["CPU 1 Memory:",1,1,null,null,null,{"$f":"(C10-1)*INDEX(Memory!B$4:B$16,$B10)/12/0.9","v":0},null,null,null,0,0,{"$f":"G10*12","v":0}]
["CPU 2 Memory:",1,1,null,null,null,null,{"$f":"(C11-1)*INDEX(Memory!B$4:B$16,$B11)/12/0.9","v":0},null,null,0,0,{"$f":"H11*12","v":0}]
["PCIe Slot 1:",1,null,{"$f":"INDEX(PCI!B$2:B$8,$B12)","v":0},{"$f":"INDEX(PCI!C$2:C$8,$B12)","v":0},{"$f":"INDEX(PCI!D$2:D$8,$B12)+((D12*3.3)/12)/$P$2+((E12*5)/12)/$Q$2","v":0},null,null,null,null,0,0,{"$f":"F12*12","v":0}]
[]
["PCIe Slot 2:",1,null,{"$f":"INDEX(PCI!B$10:B$15,$B14)","v":0},{"$f":"INDEX(PCI!C$10:C$15,$B14)","v":0},{"$f":"INDEX(PCI!D$10:D$15,$B14)+((D14*3.3)/12)/$P$2+((E14*5)/12)/$Q$2","v":0},null,null,null,null,0,0,{"$f":"F14*12","v":0}]
["M.2: ",1,null,null,null,{"$f":"INDEX(HardDrive!D$25:D$30,$B15)","v":0},null,null,null,null,{"$f":"F15+G15+H15","v":0},{"$f":"I15/0.87/12","v":0},{"$f":"F15*12","v":0}]
[]
[null,"Compute Module 1 SubTotals:",null,null,null,{"$f":"SUM(F4:F14)","v":0},{"$f":"SUM(G4:G14)","v":0},{"$f":"SUM(H6:H14)","v":0},{"$f":"SUM(I4:I14)","v":0},null,{"$f":"SUM(K4:K14)","v":0},{"$f":"SUM(L4:L14)","v":0},{"$f":"SUM(M3:M14)","v":0},null,"CPU1","CPU2","DIMM1","DIMM2"]
[null,"CLST Allowance:",null,null,null,null,null,null,null,null,{"$f":"M18/12","v":0},0,{"$f":"SUM(O18:R18)","v":0},null,{"$f":"IF(B4>1,INDEX(Processors!G2:G54,$B4)*(C5-1),0)","v":0},{"$f":"IF(B6>1,INDEX(Processors!G2:G54,$B6)*(C7-1),0)","v":0},{"$f":"IF(C10>1,INDEX(Memory!Q4:T14,'Configure Module 1'!B10,$C10-1),0)","v":0},{"$f":"IF(C11>1,INDEX(Memory!Q4:T14,'Configure Module 1'!B11,$C11-1),0)","v":0}]

{"sheet":"Configure Module 2","index":5,"n_rows":18,"n_cols":18,"rows_kept":18,"cut":false,"hidden":false,"merged":[[0,1,0,12]]}
["Power Budget",{"$f":"CONCATENATE(\"Compute Module 2: \",INDEX(Serverboard!A$2:A$13,$B3),\" Configuration\")","v":"Compute Module 2: (Select Serverboard) Configuration"},null,null,null,null,null,null,null,null,null,null,null,null,"CPU VRM Efficiency","3.3v VRM Efficiency","5v VRM Efficiency"]
["Serverboard Feature","Description",null,null,"+5V (amps)"," +12V (amps)","12V CPU1 (amps)","12V CPU2 (amps)","5V \nstby (amps)","Max 3.3v/5v (watts)","12V\nMAIN\n(Amps)","12V\nStby\n(Amps)","Power (Watts)",null,{"$f":"INDEX(Serverboard!H$2:H$11,$B3)","v":1},{"$f":"INDEX(Serverboard!I$2:I$11,$B3)","v":1},{"$f":"INDEX(Serverboard!J$2:J$11,$B3)","v":1}]
["Computer Node:",1,null,{"$f":"INDEX(Serverboard!B$2:B$13,$B3) *1","v":0},{"$f":"INDEX(Serverboard!C$2:C$13,$B3) *1","v":0},{"$f":"INDEX(Serverboard!D$2:D$13,$B3) *1","v":0},null,null,{"$f":"INDEX(Serverboard!F$2:F$13,$B3) *1","v":0},null,{"$f":"F3+G3+H3","v":0},{"$f":"I3/0.87/12*5","v":0},{"$f":"INDEX(Serverboard!G$2:G$13,$B3) *1","v":0}]
["Processors 1:",1,null,null,null,null,{"$f":"(C5-1)*INDEX(Processors!B$2:B$60,$B4)/12/VRMefficiency","v":0},null,null,null,{"$f":"F4+G4+H4+I4","v":0},{"$f":"I4/0.87","v":0},{"$f":"K4*12","v":0},"*This line includes correction factors."]
[null,"Quantity:",1]
["Processors 2:",1,null,null,null,null,null,{"$f":"(C7-1)*INDEX(Processors!B$2:B$60,$B6)/12/VRMefficiency","v":0},null,null,{"$f":"F6+G6+H6+I6","v":0},{"$f":"I6/0.87","v":0},{"$f":"K6*12","v":0},"*This line includes correction factors."]
[null,"Quantity:",1]
[]
["System Fans:",{"$f":"IF((B3>1)*AND(B3<10),\"3 X 4056 dual rotor fan\",\"\")","v":""},null,null,null,{"$f":"IF(B9=\"\",0,6.3)","v":0},null,null,null,null,{"$f":"F9+G9+H9","v":0},{"$f":"I9/0.87/12","v":0},{"$f":"K9*12","v":0}]
["CPU 1 Memory:",1,1,null,null,null,{"$f":"(C10-1)*INDEX(Memory!B$4:B$16,$B10)/12/0.9","v":0},null,null,null,0,0,{"$f":"G10*12","v":0}]
["CPU 2 Memory:",1,1,null,null,null,null,{"$f":"(C11-1)*INDEX(Memory!B$4:B$16,$B11)/12/0.9","v":0},null,null,0,0,{"$f":"H11*12","v":0}]
["PCIe Slot 1:",1,null,{"$f":"INDEX(PCI!B$2:B$8,$B12)","v":0},{"$f":"INDEX(PCI!C$2:C$8,$B12)","v":0},{"$f":"INDEX(PCI!D$2:D$8,$B12)+((D12*3.3)/12)/$P$2+((E12*5)/12)/$Q$2","v":0},null,null,null,null,0,0,{"$f":"F12*12","v":0}]
[]
["PCIe Slot 2:",1,null,{"$f":"INDEX(PCI!B$10:B$15,$B14)","v":0},{"$f":"INDEX(PCI!C$10:C$15,$B14)","v":0},{"$f":"INDEX(PCI!D$10:D$15,$B14)+((D14*3.3)/12)/$P$2+((E14*5)/12)/$Q$2","v":0},null,null,null,null,0,0,{"$f":"F14*12","v":0}]
["M.2: ",1,null,null,null,{"$f":"INDEX(HardDrive!D$25:D$30,$B15)","v":0},null,null,null,null,0,0,{"$f":"F15*12","v":0}]
[]
[null,"Compute Module 1 SubTotals:",null,null,null,{"$f":"SUM(F4:F14)","v":0},{"$f":"SUM(G4:G14)","v":0},{"$f":"SUM(H6:H14)","v":0},{"$f":"SUM(I4:I14)","v":0},null,{"$f":"SUM(K4:K14)","v":0},{"$f":"SUM(L4:L14)","v":0},{"$f":"SUM(M3:M14)","v":0},null,"CPU1","CPU2","DIMM1","DIMM2"]
[null,"CLST Allowance:",null,null,null,null,null,null,null,null,{"$f":"M18/12","v":0},0,{"$f":"SUM(O18:R18)","v":0},null,{"$f":"IF(B4>1,INDEX(Processors!G2:G54,$B4)*(C5-1),0)","v":0},{"$f":"IF(B6>1,INDEX(Processors!G2:G54,$B6)*(C7-1),0)","v":0},{"$f":"IF(C10>1,INDEX(Memory!Q4:T14,'Configure Module 2'!B10,$C10-1),0)","v":0},{"$f":"IF(C11>1,INDEX(Memory!Q4:T14,'Configure Module 2'!B11,$C11-1),0)","v":0}]

{"sheet":"Configure Module 3","index":6,"n_rows":18,"n_cols":18,"rows_kept":18,"cut":false,"hidden":false,"merged":[[0,1,0,12]]}
["Power Budget",{"$f":"CONCATENATE(\"Compute Module 3: \",INDEX(Serverboard!A$2:A$13,$B3),\" Configuration\")","v":"Compute Module 3: (Select Serverboard) Configuration"},null,null,null,null,null,null,null,null,null,null,null,null,"CPU VRM Efficiency","3.3v VRM Efficiency","5v VRM Efficiency"]
["Serverboard Feature","Description",null,"+3.3V (amps)","+5V (amps)"," +12V (amps)","12V CPU1 (amps)","12V CPU2 (amps)","5V \nstby (amps)","Max 3.3v/5v (watts)","12V\nMAIN\n(Amps)","12V\nStby\n(Amps)","Power (Watts)",null,{"$f":"INDEX(Serverboard!H$2:H$11,$B3)","v":1},{"$f":"INDEX(Serverboard!I$2:I$11,$B3)","v":1},{"$f":"INDEX(Serverboard!J$2:J$11,$B3)","v":1}]
["Computer Node:",1,null,{"$f":"INDEX(Serverboard!B$2:B$13,$B3) *1","v":0},{"$f":"INDEX(Serverboard!C$2:C$13,$B3) *1","v":0},{"$f":"INDEX(Serverboard!D$2:D$13,$B3) *1","v":0},null,null,{"$f":"INDEX(Serverboard!F$2:F$13,$B3) *1","v":0},null,{"$f":"F3+G3+H3","v":0},{"$f":"I3/0.87/12*5","v":0},{"$f":"INDEX(Serverboard!G$2:G$13,$B3) *1","v":0}]
["Processors 1:",1,null,null,null,null,{"$f":"(C5-1)*INDEX(Processors!B$2:B$60,$B4)/12/VRMefficiency","v":0},null,null,null,{"$f":"F4+G4+H4+I4","v":0},{"$f":"I4/0.87","v":0},{"$f":"K4*12","v":0},"*This line includes correction factors."]
[null,"Quantity:",1]
["Processors 2:",1,null,null,null,null,null,{"$f":"(C7-1)*INDEX(Processors!B$2:B$60,$B6)/12/VRMefficiency","v":0},null,null,{"$f":"F6+G6+H6+I6","v":0},{"$f":"I6/0.87","v":0},{"$f":"K6*12","v":0},"*This line includes correction factors."]
[null,"Quantity:",1]
[]
["System Fans:",{"$f":"IF((B3>1)*AND(B3<10),\"3 X 4056 dual rotor fan\",\"\")","v":""},null,null,null,{"$f":"IF(B9=\"\",0,6.3)","v":0},null,null,null,null,{"$f":"F9+G9+H9","v":0},{"$f":"I9/0.87/12","v":0},{"$f":"K9*12","v":0}]
["CPU 1 Memory:",1,1,null,null,null,{"$f":"(C10-1)*INDEX(Memory!B$4:B$16,$B10)/12/0.9","v":0},null,null,null,0,0,{"$f":"G10*12","v":0}]
["CPU 2 Memory:",1,1,null,null,null,null,{"$f":"(C10-1)*INDEX(Memory!B$4:B$16,$B10)/12/0.9","v":0},null,null,0,0,{"$f":"H11*12","v":0}]
["PCIe Slot 1:",1,null,{"$f":"INDEX(PCI!B$2:B$8,$B12)","v":0},{"$f":"INDEX(PCI!C$2:C$8,$B12)","v":0},{"$f":"INDEX(PCI!D$2:D$8,$B12)+((D12*3.3)/12)/$P$2+((E12*5)/12)/$Q$2","v":0},null,null,null,null,0,0,{"$f":"F12*12","v":0}]
[]
["PCIe Slot 2:",1,null,{"$f":"INDEX(PCI!B$10:B$15,$B14)","v":0},{"$f":"INDEX(PCI!C$10:C$15,$B14)","v":0},{"$f":"INDEX(PCI!D$10:D$15,$B14)+((D14*3.3)/12)/$P$2+((E14*5)/12)/$Q$2","v":0},null,null,null,null,0,0,{"$f":"F14*12","v":0}]
["M.2: ",1,null,null,null,{"$f":"INDEX(HardDrive!D$25:D$30,$B15)","v":0},null,null,null,null,0,0,{"$f":"F15*12","v":0}]
[]
[null,"Compute Module 1 SubTotals:",null,null,null,{"$f":"SUM(F4:F14)","v":0},{"$f":"SUM(G4:G14)","v":0},{"$f":"SUM(H6:H14)","v":0},{"$f":"SUM(I4:I14)","v":0},null,{"$f":"SUM(K4:K14)","v":0},{"$f":"SUM(L4:L14)","v":0},{"$f":"SUM(M3:M14)","v":0},null,"CPU1","CPU2","DIMM1","DIMM2"]
[null,"CLST Allowance:",null,null,null,null,null,null,null,null,{"$f":"M18/12","v":0},0,{"$f":"SUM(O18:R18)","v":0},null,{"$f":"IF(B4>1,INDEX(Processors!G2:G54,$B4)*(C5-1),0)","v":0},{"$f":"IF(B6>1,INDEX(Processors!G2:G54,$B6)*(C7-1),0)","v":0},{"$f":"IF(C10>1,INDEX(Memory!Q4:T14,'Configure Module 3'!B10,$C10-1),0)","v":0},{"$f":"IF(C11>1,INDEX(Memory!Q4:T14,'Configure Module 3'!B11,$C11-1),0)","v":0}]

{"sheet":"Configure Module 4","index":7,"n_rows":18,"n_cols":18,"rows_kept":18,"cut":false,"hidden":false,"merged":[[0,1,0,12]]}
["Power Budget",{"$f":"CONCATENATE(\"Compute Module 4: \",INDEX(Serverboard!A$2:A$13,$B3),\" Configuration\")","v":"Compute Module 4: (Select Serverboard) Configuration"},null,null,null,null,null,null,null,null,null,null,null,null,"CPU VRM Efficiency","3.3v VRM Efficiency","5v VRM Efficiency"]
["Serverboard Feature","Description",null,"+3.3V (amps)","+5V (amps)"," +12V (amps)","12V CPU1 (amps)","12V CPU2 (amps)","5V \nstby (amps)","Max 3.3v/5v (watts)","12V\nMAIN\n(Amps)","12V\nStby\n(Amps)","Power (Watts)",null,{"$f":"INDEX(Serverboard!H$2:H$11,$B3)","v":1},{"$f":"INDEX(Serverboard!I$2:I$11,$B3)","v":1},{"$f":"INDEX(Serverboard!J$2:J$11,$B3)","v":1}]
["Computer Node:",1,null,{"$f":"INDEX(Serverboard!B$2:B$13,$B3) *1","v":0},{"$f":"INDEX(Serverboard!C$2:C$13,$B3) *1","v":0},{"$f":"INDEX(Serverboard!D$2:D$13,$B3) *1","v":0},null,null,{"$f":"INDEX(Serverboard!F$2:F$13,$B3) *1","v":0},null,{"$f":"F3+G3+H3","v":0},{"$f":"I3/0.87/12*5","v":0},{"$f":"INDEX(Serverboard!G$2:G$13,$B3) *1","v":0}]
["Processors 1:",1,null,null,null,null,{"$f":"(C5-1)*INDEX(Processors!B$2:B$60,$B4)/12/VRMefficiency","v":0},null,null,null,{"$f":"F4+G4+H4+I4","v":0},{"$f":"I4/0.87","v":0},{"$f":"K4*12","v":0},"*This line includes correction factors."]
[null,"Quantity:",1]
["Processors 2:",1,null,null,null,null,null,{"$f":"(C7-1)*INDEX(Processors!B$2:B$60,$B6)/12/VRMefficiency","v":0},null,null,{"$f":"F6+G6+H6+I6","v":0},{"$f":"I6/0.87","v":0},{"$f":"K6*12","v":0},"*This line includes correction factors."]
[null,"Quantity:",1]
[]
["System Fans:",{"$f":"IF((B3>1)*AND(B3<10),\"3 X 4056 dual rotor fan\",\"\")","v":""},null,null,null,{"$f":"IF(B9=\"\",0,6.3)","v":0},null,null,null,null,{"$f":"F9+G9+H9","v":0},{"$f":"I9/0.87/12","v":0},{"$f":"K9*12","v":0}]
["CPU 1 Memory:",1,1,null,null,null,{"$f":"(C10-1)*INDEX(Memory!B$4:B$16,$B10)/12/0.9","v":0},null,null,null,0,0,{"$f":"G10*12","v":0}]
["CPU 2 Memory:",1,1,null,null,null,null,{"$f":"(C11-1)*INDEX(Memory!B$4:B$16,$B11)/12/0.9","v":0},null,null,0,0,{"$f":"H11*12","v":0}]
["PCIe Slot 1:",1,null,{"$f":"INDEX(PCI!B$2:B$8,$B12)","v":0},{"$f":"INDEX(PCI!C$2:C$8,$B12)","v":0},{"$f":"INDEX(PCI!D$2:D$8,$B12)+((D12*3.3)/12)/$P$2+((E12*5)/12)/$Q$2","v":0},null,null,null,null,0,0,{"$f":"F12*12","v":0}]
[]
["PCIe Slot 2:",1,null,{"$f":"INDEX(PCI!B$10:B$15,$B14)","v":0},{"$f":"INDEX(PCI!C$10:C$15,$B14)","v":0},{"$f":"INDEX(PCI!D$10:D$15,$B14)+((D14*3.3)/12)/$P$2+((E14*5)/12)/$Q$2","v":0},null,null,null,null,0,0,{"$f":"F14*12","v":0}]
["M.2: ",1,null,null,null,{"$f":"INDEX(HardDrive!D$25:D$30,$B15)","v":0},null,null,null,null,0,0,{"$f":"F15*12","v":0}]
[]
[null,"Compute Module 1 SubTotals:",null,null,null,{"$f":"SUM(F4:F14)","v":0},{"$f":"SUM(G4:G14)","v":0},{"$f":"SUM(H6:H14)","v":0},{"$f":"SUM(I4:I14)","v":0},null,{"$f":"SUM(K4:K14)","v":0},{"$f":"SUM(L4:L14)","v":0},{"$f":"SUM(M3:M14)","v":0},null,"CPU1","CPU2","DIMM1","DIMM2"]
[null,"CLST Allowance:",null,null,null,null,null,null,null,null,{"$f":"M18/12","v":0},0,{"$f":"SUM(O18:R18)","v":0},null,{"$f":"IF(B4>1,INDEX(Processors!G2:G54,$B4)*(C5-1),0)","v":0},{"$f":"IF(B6>1,INDEX(Processors!G2:G54,$B6)*(C7-1),0)","v":0},{"$f":"IF(C10>1,INDEX(Memory!Q4:T14,'Configure Module 4'!B10,$C10-1),0)","v":0},{"$f":"IF(C11>1,INDEX(Memory!Q4:T14,'Configure Module 4'!B11,$C11-1),0)","v":0}]

{"sheet":"Serverboard","index":8,"n_rows":11,"n_cols":12,"rows_kept":11,"cut":false,"hidden":false,"merged":[]}
["Serverboard",3.3,5,"12BB",-12,"5VSB","Watts","CPU\nVRM%","5v\nVRM%","3v\nVRM%","MAX DIMM/socket"]
["(Select Serverboard)",null,null,null,null,null,null,1,1,1]
["HNS2600BPBR",null,null,4.5,null,null,{"$f":"B3*3.3+C3*5+D3*12+E3*12+F3*5","v":54},0.92,0.9,0.9,8]
["HNS2600BPQR",null,null,5.08,null,null,60.96,0.92,0.9,0.9,8]
["HNS2600BPSR",null,null,3.8330000000000002,null,null,45.996000000000002,0.92,0.9,0.9,8]
["HNS2600BPB24R",null,null,4.5,null,null,54,0.92,0.9,0.9,8]
["HNS2600BPQ24R",null,null,5.08,null,null,60.96,0.92,0.9,0.9,8]
["HNS2600BPS24R",null,null,3.8330000000000002,null,null,45.996000000000002,0.92,0.9,0.9,8]
["HNS2600BPBLCR",null,null,4.83,null,null,{"$f":"B9*3.3+C9*5+D9*12+E9*12+F9*5","v":57.96},0.92,0.9,0.9,8]
["HNS2600BPBLC24R",null,null,4.83,null,null,{"$f":"B10*3.3+C10*5+D10*12+E10*12+F10*5","v":57.96},0.92,0.9,0.9,8]
["User Definable",null,null,null,null,null,{"$f":"B11*3.3+C11*5+D11*12+E11*12+F11*5","v":0},null,null,null,null,"<-- Define Custom Numbers Here"]

{"sheet":"Chassis Definition","index":9,"n_rows":32,"n_cols":16,"rows_kept":32,"cut":false,"hidden":false,"merged":[[28,1,28,6],[28,13,28,14],[0,13,0,14],[0,1,0,6]]}
["Chassis","PS limits",null,null,null,null,null,"Max W","Total","Fans","PCI ","Max","HSBP ","PS Eff%"]
["Selection","Form factor","5V","12V\n230VAC","12V\n115VAC","12VStby","5VSB","3.3v/5v","Watts","12V","slots","HDD","VR Eff%","220v","110v"]
["(Select Chassis)",null,null,0,0,0,null,null,null,0,null,0,1,1,1]
["H2312XXLR3 (2X 2130W CRPS)","2U",null,163,104,3.5,null,null,null,0,null,3,0.95,0.94,0.92]
["H2224XXLR3 (2X 2130W CRPS)","2U",null,163,104,3.5,null,null,null,0,null,6,0.95,0.94,0.92]
["H2204XXLRE (2x2130W CRPS)","2U",null,163,104,3.5,null,null,null,0,null,1,0.95,0.94,0.92]
["User Definable"]
["User Definable"]
["User Definable"]
["User Definable",null,null,null,null,null,null,null,{"$f":"D10*12+E10*12+F10*12+G10*5","v":0},null,null,null,null,null,null,"<-- Define Custom Numbers Here"]
["User Definable",null,null,null,null,null,null,null,{"$f":"D11*12+E11*12+F11*12+G11*5","v":0},null,null,null,null,null,null,"<-- Define Custom Numbers Here"]
["User Definable",null,null,null,null,null,null,null,{"$f":"D12*12+E12*12+F12*12+G12*5","v":0},null,null,null,null,null,null,"<-- Define Custom Numbers Here"]
[]
[]
[]
["Note: HS Fan  (Y/N) determines if an Active Heatsink (Heatsink with Fan) in Intel® Boxed Processors is used (adds fan power to budget)"]
["Note: PS Eff is estimate @ typ voltage & 35% to 90% loading based on PS measurement data."]
[]
[]
[]
[]
[]
[]
[]
[]
[]
[]
[]
["Chassis","PS limits",null,null,null,null,null,"Max W","Total","Fans","PCI ","Max","HSBP ","PS Eff%"]
["Selection","3V","5V","12VBB","12V CPU1","12V CPU2","5VSB","3.3v/5v","Watts","12V","slots","HDD","VR Eff%","110v","220v"]
["(Select Chassis)",null,null,null,null,null,null,null,null,null,null,99,1,1,1]
["Example 1"]

{"sheet":"Processors","index":10,"n_rows":62,"n_cols":7,"rows_kept":62,"cut":false,"hidden":false,"merged":[]}
["Processor Types","TDP (W)","HS Fan (A)","Source",null,null,"CLST Saving"]
["(Select Processor)"]
["Intel® Xeon® Gold 6262 Processor (33M Cache, 1.90 GHz)",135,null,null,null,45,87]
["Intel® Xeon® Gold 6238L Processor (30.25M Cache, 2.10 GHz)",140,null,null,null,40,{"$f":"(B4-F4)*0.8","v":80}]
["Intel® Xeon® Gold 6252 Processor (35.75M Cache, 2.10 GHz)",150,null,null,null,40,68]
["Intel® Xeon® Gold 6248 Processor (27.5M Cache, 2.50 GHz)",150,null,null,null,40,87]
["Intel® Xeon® Gold 6244 Processor (24.75M Cache, 3.60 GHz)",150,null,null,null,40,75]
["Intel® Xeon® Gold 6242 Processor (22M Cache, 2.80 GHz)",150,null,null,null,40,75]
["Intel® Xeon® Gold 6240Y Processor (24.75M Cache, 2.60 GHz)",150,null,null,null,35,50]
["Intel® Xeon® Gold 6240 Processor (24.75M Cache, 2.60 GHz)",150,null,null,null,35,70]
["Intel® Xeon® Gold 6238T Processor (30.25M Cache, 1.90 GHz)",125,null,null,null,35,50]
["Intel® Xeon® Gold 6230N Processor (27.5M Cache, 2.30 GHz)",125,null,null,null,40,68]
["Intel® Xeon® Gold 6230 Processor (27.5M Cache, 2.10 GHz)",125,null,null,null,35,50]
["Intel® Xeon® Gold 6222 Processor (27.5M Cache, 1.80 GHz)",115,null,null,null,35,49]
["Intel® Xeon® Gold 5222 Processor (16.5M Cache, 3.80 GHz)",105,null,null,null,35,44]
["Intel® Xeon® Gold 5218 Processor (22M Cache, 2.30 GHz)",125,null,null,null,30,40]
["Intel® Xeon® Gold 6238M Processor (30.25M Cache, 2.10 GHz)",140,null,null,null,30,51]
["Intel® Xeon® Gold 6240L Processor (24.75M Cache, 2.60 GHz)",150,null,null,null,30,{"$f":"(B18-F18)*0.8","v":96}]
["Intel® Xeon® Gold 6240M Processor (24.75M Cache, 2.60 GHz)",150,null,null,null,30,57]
["Intel® Xeon® Platinum 8276M Processor (38.5M Cache, 2.20 GHz)",165,null,null,null,30,49]
["Intel® Xeon® Platinum 8276L Processor (38.5M Cache, 2.20 GHz)",165,null,null,null,25,57]
["Intel® Xeon® Platinum 8276 Processor (38.5M Cache, 2.20 GHz)",165,null,null,null,25,90]
["Intel® Xeon® Gold 6262V Processor (33M Cache, 1.90 GHz)",135,null,null,null,null,73]
["Intel® Xeon® Gold 6222V Processor (27.5M Cache, 1.80 GHz)",115,null,null,null,null,65]
["Intel® Xeon® Platinum 8260Y Processor (35.75M Cache, 2.40 GHz)",165,null,null,null,null,70]
["Intel® Xeon® Platinum 8260M Processor (35.75M Cache, 2.40 GHz)",165,null,null,null,null,81]
["Intel® Xeon® Platinum 8260L Processor (35.75M Cache, 2.40 GHz)",165,null,null,null,null,65]
["Intel® Xeon® Platinum 8260 Processor (35.75M Cache, 2.40 GHz)",165,null,null,null,null,84]
["Intel® Xeon® Platinum 8256 Processor (16.5M Cache, 3.80 GHz)",105,null,null,null,null,81]
["Intel® Xeon® Platinum 8253 Processor (22M Cache, 2.20 GHz)",125,null,null,null,null,87]
["Intel® Xeon® Silver 4214 Processor (16.5M Cache, 2.20 GHz)",85,null,null,null,null,65]
["Intel® Xeon® Silver 4215 Processor ( 11M Cache, 2.50 GHz)",85,null,null,null,null,50]
["Intel® Xeon® Silver 4216 Processor (22M Cache, 2.10 GHz)",100,null,null,null,null,61]
[" Intel® Xeon® Gold 5215 Processor ( 13.75M Chace, 2.50 GHz)",85,null,null,null,null,55]
["Intel® Xeon® Gold 5215L Processor (13.75M Cache, 2.50 GHz)",85,null,null,null,null,52]
["Intel® Xeon® Gold 5215M Processor (13.5M Cache, 2.50 GHz)",85,null,null,null,null,42]
["Intel® Xeon® Gold 5217 Processor (11M Cache, 3.00 GHz)",115,null,null,null,null,55]
["Intel® Xeon® Gold 5218N Processor (22M Cache, 2.30 GHz)",105,null,null,null,null,47]
["Intel® Xeon® Gold 5220 Processor (24.75M Cache, 2.20 GHz)",125,null,null,null,null,52]
["Intel® Xeon® Silver 4214Y Processor (16.5M Cache, 2.20 GHz)",85,null,null,null,null,46]
["Intel® Xeon® Gold 5218B Processor (22M Cache, 2.30 GHz)",125,null,null,null,null,47]
["Intel® Xeon® Silver 4210 Processor (13.75M Cache, 2.20 GHz)",85,null,null,null,null,50]
["Intel® Xeon® Silver 4208 Processor (11M Cache, 2.10 GHz)",85,null,null,null,null,54]
["Intel® Xeon® Bronze 3204 Processor (8.25M Cache, 1.90 GHz)",85,null,null,null,null,43]
["Intel® Xeon® Silver 4209T Processor (11M Cache, 2.20 GHz)",70,null,null,null,null,50]
["Intel® Xeon® Gold 6246 Processor (24.75M Cache, 3.30 GHz)",165,null,null,null,null,54]
["Intel® Xeon® Gold 5220T Processor (24.75M Cache, 1.96 GHz)",105,null,null,null,null,49]
["Intel® Xeon® Gold 6238 Processor (30.25M Cache, 2.10 GHz)",140]
["Intel® Xeon® Gold 5218T Processor (22M Cache, 2.10 GHz)",105]
["Intel® Xeon® Gold 6234 Processor (24.75M Cache, 3.30 GHz)",130]
["Intel® Xeon® Gold 6226 Processor (19.25M Cache, 2.70 GHz)",125]
["Intel® Xeon® Gold 6252N Processor (35.75M Cache, 2.30 GHz)",150]
["Intel® Xeon® Gold 6230T Processor (27.5M Cache, 2.10 GHz)",125]
["Intel® Xeon® Gold 5220S Processor (24.75M Cache, 2.70 GHz)",125]
[]
[]
[]
[]
[]
[]
[0]
[1]

{"sheet":"Memory","index":11,"n_rows":40,"n_cols":20,"rows_kept":40,"cut":false,"hidden":false,"merged":[[1,16,1,19],[1,1,1,9],[34,11,34,12],[34,5,34,6],[1,12,1,13],[1,14,1,15],[0,1,0,9],[34,1,34,2],[34,3,34,4],[34,7,34,8],[34,9,34,10]]}
[null,"Watts of +12V"]
[null,"# of DIMMS",null,null,null,null,null,null,null,null,null,null,"Hi Stress DIMM P",null,"Min Throtted P",null,"CLST Saving"]
["Memory",1,2,6,8,null,null,null,null,null,null,null,"1DPC","2DPC","1DPC","2DPC",1,2,4,8]
["(Select Memory)",0,0,0,0]
["4GB DDR4 RDIMM (4Gb, SRx8)",{"$f":"M5*1","v":3},{"$f":"M5*2","v":6},{"$f":"M5*6","v":18},{"$f":"N5*4+M5*4","v":21.2},null,null,null,null,null,null,null,3,2.2999999999999998,2,1.6,{"$f":"B5-O5","v":1},{"$f":"(M5-O5)*2","v":2},{"$f":"(M5-O5)*4","v":4},{"$f":"(N5-P5)*8","v":5.5999999999999979}]
["8GB DDR4 RDIMM (4Gb, SRx4)",4.8,{"$f":"M6*2","v":8},{"$f":"M6*6","v":24},{"$f":"N6*4+M6*4","v":28},null,null,null,null,null,null,null,4,3,2.2000000000000002,2,{"$f":"B6-O6","v":2.5999999999999996},{"$f":"(M6-O6)*2","v":3.5999999999999996},{"$f":"(M6-O6)*4","v":7.1999999999999993},{"$f":"(N6-P6)*8","v":8}]
["8GB DDR4 RDIMM (8Gb, SRx8)",3.5,6,18,21.2,null,null,null,null,null,null,null,3,2.2999999999999998,2,1.6,1.5,2,4,5.5999999999999979]
["8GB DDR4 RDIMM (4Gb, DRx8)",3.8,7.2,21.6,25.200000000000003,null,null,null,null,null,null,null,3.6,2.7,2.8,2,1,1.6000000000000005,3.2000000000000011,5.6000000000000014]
["16GB DDR4 RDIMM (8Gb, SRx4)",5.2,8,24,28,null,null,null,null,null,null,null,4,3,2.2000000000000002,2,3,3.5999999999999996,7.1999999999999993,8]
["16GB DDR4 RDIMM (4Gb, DRx4)",5.7,12.6,37.799999999999997,44.099999999999994,null,null,null,null,null,null,null,6.3,4.7249999999999996,3.6,3.3,2.1,5.3999999999999995,10.799999999999999,11.399999999999999]
["16GB DDR4 RDIMM (8Gb, DRx8)",4.2,7.2,21.6,25.200000000000003,null,null,null,null,null,null,null,3.6,2.7,2.8,2,1.4000000000000004,1.6000000000000005,3.2000000000000011,5.6000000000000014]
["32GB DDR4 RDIMM (8Gb, DRx4)",6.5,12.6,37.799999999999997,44.099999999999994,null,null,null,null,null,null,null,6.3,4.7249999999999996,3.6,3.3,2.9,5.3999999999999995,10.799999999999999,11.399999999999999]
["32GB DDR4 LRDIMM (4Gb, QRx4)",9.4,21.2,63.599999999999994,74.400000000000006,null,null,null,null,null,null,null,10.6,8,6.8,6.4,2.6000000000000005,7.6,15.2,12.799999999999997]
["64GB DDR4 LRDIMM (8Gb, QRx4)",11.1,22,66,77,null,null,null,null,null,null,null,11,8.25,6.8,6.4,4.3,8.4,16.8,14.799999999999997]
["128GB AEP",15,null,null,null,null,null,null,null,null,"<-- Define Custom Numbers Here"]
["256GB AEP",18,null,null,null,null,null,null,null,null,"<-- Define Custom Numbers Here"]
["User Definable",null,null,null,null,null,null,null,null,null,"<-- Define Custom Numbers Here"]
[]
[]
[]
["Note:"]
["DIMM power will vary depending on the # of DIMMs & the actual strees/bandwidth used."]
[]
[0]
[1]
[2]
[3]
[4]
[5]
[6]
[7]
[8]
[]
[]
["EP-DDR4","Frequency",null,"min Throttled BW/DIMM",null,"min DIMM P",null,"Hi Stress DIMM P",null,"Acoustic DIMM P",null,"Min Throtted DIMM P"]
["EP","1DPC","2DPC","1DPC","2DPC","1DPC","2DPC","1DPC","2DPC","1DPC","2DPC","1DPC","2DPC"]
["LR-DIMM 3D4S 8Rx4 (4Gb-8Gb not available)",2400,2133,1.9,0.9,0,0,0,0,0,0,0,0]
["LRDIMM DDP-QRx4",2400,2133,1.9,0.9,8.3000000000000007,7.1,11.3,8.6999999999999993,7.3,6.6,6.8,6.4,{"$f":"I38/H38","v":0.76991150442477863}]
["RDIMM-DRx4",2400,2133,1.9,0.9,4.5,3.8,6.3,4.5999999999999996,3.9,3.5,3.6,3.3,{"$f":"I39/H39","v":0.73015873015873012}]
["RDIMM-2Rx8, 1Rx4",2400,2133,1.9,0.9,2.8,2.2999999999999998,4,3,2.4,2.1,2.2000000000000002,2,{"$f":"I40/H40","v":0.75}]

{"sheet":"PCI","index":12,"n_rows":15,"n_cols":7,"rows_kept":15,"cut":false,"hidden":false,"merged":[]}
["PCIe slot 1 Add in Cards","Amps of +3.3V","Amps of +5V","Amps of +12VBB","Amps of    -12V","Watts"]
["Slot Empty",null,null,null,null," "]
["PCIe 5W",null,null,0.44,null,{"$f":"B3*3.3+C3*5+D3*12+E3*12","v":5.28}]
["PCIe10W",null,null,0.83,null,9.9599999999999991]
["PCIe15W",null,null,1.25,null,15]
["PCIe SSD 25W",null,null,2.0830000000000002,null,24.996000000000002,"<-- Define Custom Card Here"]
["User Definable ",null,null,null,null,0,"<-- Define Custom Card Here"]
["User Definable ",null,null,null,null,0,"<-- Define Custom Card Here"]
["PCIe slot 2 Add in Cards","Amps of +3.3V","Amps of +5V","Amps of +12VBB","Amps of    -12V","Watts"]
["Slot Empty",null,null,null,null," "]
["PCIe 5W",null,null,0.44,null,{"$f":"B11*3.3+C11*5+D11*12+E11*12","v":5.28}]
["PCIe10W",null,null,0.83,null,{"$f":"B12*3.3+C12*5+D12*12+E12*12","v":9.9599999999999991}]
["PCIe15W",null,null,1.25,null,{"$f":"B13*3.3+C13*5+D13*12+E13*12","v":15}]
["PCIe SSD 25W",null,null,2.0830000000000002,null,{"$f":"B14*3.3+C14*5+D14*12+E14*12","v":24.996000000000002},"<-- Define Custom Card Here"]
["User Definable ",null,null,null,null,null,"<-- Define Custom Card Here"]

{"sheet":"HSBP","index":13,"n_rows":8,"n_cols":8,"rows_kept":8,"cut":false,"hidden":false,"merged":[]}
["Backplane / Midplane","+3.3V (A)","+5V (A)","+12VMAIN","-12V (A)"," 5vsb (A)","W"]
["Select Backplane or Midplane",0,0,0,0,0,{"$f":"E2*(-12)+D2*12+C2*5+B2*3.3","v":0}]
["12 X 3.5'' Passive BP (FH2K12X35HSBP)",null,null,{"$f":"0.2+0.4","v":0.60000000000000009},null,null,{"$f":"B3*3.3+C3*5+D3*12+E3*12+F3*5","v":7.2000000000000011}]
["24X 2.5\" Passive BP (FHW24X25HSBP)",null,null,{"$f":"1.3+0.4","v":1.7000000000000002},null,null,{"$f":"B4*3.3+C4*5+D4*12+E4*12+F4*5+5","v":25.400000000000002}]
["4x3.5\" Passive BP (FHW04X35HSBP)",null,null,0.3,null,null,{"$f":"B5*3.3+C5*5+D5*12+E5*12+F5*5","v":3.5999999999999996}]
[null,null,null,null,null,null,{"$f":"F6*5+E6*(12)+D6*12+C6*5+B6*3.3","v":0},"<-- Define Custom Peripherals Here"]
[null,null,null,null,null,null,null,"<-- Define Custom Peripherals Here"]
[null,null,null,null,null,null,null,"<-- Define Custom Peripherals Here"]

{"sheet":"HardDrive","index":14,"n_rows":30,"n_cols":6,"rows_kept":30,"cut":false,"hidden":false,"merged":[]}
["Hard Drives","Amps of +3.3V","Amps of +5V","Amps of +12V","Watts"]
["Empty",null,null,null,{"$f":"C2*5+D2*12","v":0}]
["3.5\" SATA Typical Power (12W)",null,0.5,0.8,12.100000000000001]
["3.5\" SAS Typical Power (15W)",null,0.8,0.92,15.040000000000001]
["2.5\" SATA Typical Power (5W)",null,1,0,5]
["2.5\" SAS Typical Power (9W)",null,0.81,0.41,8.9700000000000006]
["2.5\" SATA SSD Typical Power (5W)",null,1,0,{"$f":"C7*5+D7*12","v":5}]
["User Definable",null,null,null,0,"<-- Define Custom Device Here"]
["User Definable",null,null,null,0,"<-- Define Custom Device Here"]
["User Definable",null,null,null,0,"<-- Define Custom Device Here"]
[]
[]
[]
[]
["PCIe SSD","Amps of +3.3V","Amps of +5V","Amps of +12V","Watts"]
["Empty",null,null,null,{"$f":"C16*5+D16*12","v":0}]
["Intel® SSD DC P3700/P3600/P3500 Series 2.5\" FF, 2.0TB",null,null,2.08,24.96]
["Intel® SSD DC P3700/P3600/P3500 Series 2.5\" FF, 400GB",null,null,0.67,{"$f":"C18*5+D18*12","v":8.0400000000000009}]
["User Definable",null,null,null,0,"<-- Define Custom Device Here"]
["User Definable",null,null,null,0,"<-- Define Custom Device Here"]
["User Definable",null,null,null,0,"<-- Define Custom Device Here"]
[]
[]
["M.2","Amps of +3.3V","Amps of +5V","Amps of +12V","Watts"]
["Empty",null,null,null,{"$f":"C25*5+D25*12","v":0}]
["PCIe 80mm M.2 Typical Power",null,null,0.45800000000000002,5.4960000000000004]
["SATA 42mm M.2 Typical Power",null,null,0.2,2.4000000000000004]
["User Definable",null,null,null,0,"<-- Define Custom Device Here"]
["User Definable",null,null,null,0,"<-- Define Custom Device Here"]
["User Definable",null,null,null,0,"<-- Define Custom Device Here"]

{"sheet":"Peripherals","index":15,"n_rows":18,"n_cols":8,"rows_kept":18,"cut":false,"hidden":false,"merged":[]}
["Misc Peripherals","Amps of +3.3V","Amps of +5V","Amps of +12V","Amps of    -12V","Amps of 3vsb","Watts"]
["Slim-Line Devices"]
["Empty"]
["Empty"]
["User Definable",null,0.6,null,null,null,{"$f":"B5*3.3+C5*5+D5*12+E5*12+F5*5","v":3},"<-- Define Custom Peripherals Here"]
["User Definable",null,null,null,null,null,{"$f":"B6*3.3+C6*5+D6*12+E6*12+F6*5","v":0},"<-- Define Custom Peripherals Here"]
["User Definable",null,null,null,null,null,{"$f":"B7*3.3+C7*5+D7*12+E7*12+F7*5","v":0},"<-- Define Custom Peripherals Here"]
["User Definable",null,null,null,null,null,{"$f":"B8*3.3+C8*5+D8*12+E8*12+F8*5","v":0},"<-- Define Custom Peripherals Here"]
["User Definable",null,null,null,null,null,{"$f":"B9*3.3+C9*5+D9*12+E9*12+F9*5","v":0},"<-- Define Custom Peripherals Here"]
["Other Peripheral Devices"]
["Empty"]
["Empty"]
["USB floppy drive",null,0.5,null,null,null,{"$f":"B13*3.3+C13*5+D13*12+E13*12+F13*5","v":2.5}]
["User Definable",null,null,null,null,null,0,"<-- Define Custom Peripherals Here"]
["User Definable",null,null,null,null,null,0,"<-- Define Custom Peripherals Here"]
["User Definable",null,null,null,null,null,0,"<-- Define Custom Peripherals Here"]
["User Definable",null,null,null,null,null,0,"<-- Define Custom Peripherals Here"]
["User Definable",null,null,null,null,null,0,"<-- Define Custom Peripherals Here"]

{"sheet":"Taylor Pass_Normal","index":16,"n_rows":30,"n_cols":17,"rows_kept":30,"cut":false,"hidden":true,"merged":[[16,0,18,0],[19,0,21,0],[22,0,26,0],[27,0,29,0],[0,0,0,1],[4,0,15,0],[0,2,0,5],[0,11,0,15],[1,0,2,0],[3,2,3,5],[3,6,3,10],[3,11,3,15],[0,6,0,10]]}
["Notes:\n1.  27°C is limited to elevations of 900m or less\n2.  Quad Port IO Modules cannot be installed simultaneously with PCI Cards.\n3.  Processor - may have significent performance impact.\n4.  Processors - There may be some performance impact during fan failures.\n5.  For A3/A4 individual PS selection:\n      1) For dual power supply configuration, power budget must fit within single power supply rated load and be installed in dual configuration\n      2) For single power supply configuration, power budget must be sized with 30% margin to single power supply rated load.\n6.  When identifying memory in the table, only Rank and Width are required.  Capacity is not required.\n7.  Processor limited to 90W to support 1.5W AOC cable. Processor limited to 90W and memory limited to DRx4 to support 2W AOC cable. \n8. Supported with one HDD per node configuration.",null,"Base System SKUs:\nH2216TLP",null,null,null,"Base System SKUs:\nH2312TLP",null,null,null,null,"Base System SKUs:\nH2224TLP"]
["ASHRAE (See note 1)","Classifications","A2","27C","A3","A4","27C","A2","A2","A3","A4","27C","A2","A2","A3","A4"]
[null,"Max Ambient","35C","27C","40C","45C","27C","35C","35C","40C","45C","27C","35C","35C","40C","45C","<-- See note 1"]
["PS (See note 5)","Power Supplies","See Note 5",null,null,null,"See Note 5",null,null,null,null,"See Note 5"]
["EP Processors (See notes 3 and 4)","EP, 135w, 12C  (Intel® Xeon® processor E5-2690 V3)","●","●","●",null,"●",null,"●",null,"","●",null,"●",null,""]
[null,"EP, 120w, 12C  (Intel® Xeon® processor E5-2680 V3, E5-2670 V3)","●","●","●",null,"●",null,"●",null,"","●",null,"●",null,""]
[null,"EP, 105w, 10C  (Intel® Xeon® processor E5-2660 V3, E5-2650 V3)","●","●","●",null,"●",null,"●",null,null,"●",null,"●"]
[null,"EP, 90w, 8C (Intel® Xeon® processor E5-2640 V3)","●","●","●","●","●","●","●","3,4",null,"●","●","●","3,4"]
[null,"EP, 85w,8C,6C (Intel® Xeon® processor E5-2630 V3, E5-2620 V3, E5-2609 V3, E5-2603 V3)","●","●","●","●","●","●","●","3,4",3,"●","●","●","3,4",3]
[null,"EP, 135w, 8C,6C,4C (Intel® Xeon® processor E5-2667 V3, E5-2643 V3, E5-2637 V3)","3,4","●",null,null,"3,4",null,null,null,null,"3,4"]
[null,"EP, 105w, 4C (Intel® Xeon® processor E5-2623 V3)","●","●","●",null,"●",null,"●",null,null,"●",null,"●"]
[null,"EP, 65w, 12C  (Intel® Xeon® processor E5-2650L V3)","●","●","●","●","●","●","●","3,4",3,"●","●","●","3,4",3]
[null,"EP, 55w, 8C  (Intel® Xeon® processor E5-2630L V3)","●","●","●","●","●","●","●","3,4",3,"●","●","●","3,4",3]
[null,"EP, 145w, 14C,18C  (Intel® Xeon® processor E5-2697 V3, E5-2699 V3)","3,4","●",null,null,"3,4",null,null,null,null,"3,4"]
[null,"EP, 135w, 16C  (Intel® Xeon® processor E5-2698 V3)","3,4","●",null,null,"3,4",null,null,null,null,"3,4"]
[null,"EP, 120w, 14C (Intel® Xeon® processor E5-2695 V3, E5-2683 V3)","3,4","●",null,null,"3,4",null,null,null,null,"3,4"]
["Memory Type (See note 6)","RDIMM-2Rx8,1Rx4","●","●","●","●","●","●","●","●","●","●","●","●","●","●"]
[null,"RDIMM-DRx4","●","●","●","●","●","●","●","●","●","●","●","●","●","●"]
[null,"LRDIMM-QRx4 DDP","●","●","●","●","●","●","●","●","","●","●","●","●",""]
["Add-in Cards (See note 2)","PCI Cards with 100LFM/55C spec","●","●","●","●","●","●","●","●","●","●","●","●","●","●"]
[null,"PCI Cards With 200LFM/55C spec","●","●",null,null,8,"●",8,null,null,8,"●",8,null,null,"<-- See note 2"]
[null,"PCI Cards With 300LFM/55C spec",null,"●",null,null,null,8,null,null,null,null,8,null,null,null,"<-- See note 2"]
["Module (See note 2)","AXX10GBTWLIOM - Dual 10GBASE-T IO Module ","●","●","●","●","●","●","●","●","●","●","●","●","●","●"]
[null,"AXX10GBNIAIOM - Dual SFP+ port 10GbE IO Module","●","●","●","●","●","●","●","●","●","●","●","●","●","●"]
[null,"AXX1FDRIBIOM - Single Port FDR Infiniband IO Module","●","●","●","●","●","●","●","●","●","●","●","●","●","●"]
[null,"AXX2FDRIBIOM - Dual Port FDR Infiniband IO Module","●","●","●","●","●","●","●","●","●","●","●","●","●","●"]
[null,"AXX4P1GBPWLIOM - Quad Port 1GbE IO Module","●","●","●","●","●","●","●","●","●","●","●","●","●","●","<-- See note 2"]
["QSFP Cables (See note 7)","Passive Cable","●","●","●","●","●","●","●","●","●","●","●","●","●","●"]
[null,"Active Optical Cable (1.5W)","●","●",null,null,"●","●",7,null,null,"●","●",7]
[null,"Active Optical Cable (2W)",null,"●",null,null,null,"●",7,null,null,null,"●",7,null,null,"<-- See note 7"]

{"sheet":"Taylor Pass_Fan Fail","index":17,"n_rows":30,"n_cols":8,"rows_kept":30,"cut":false,"hidden":true,"merged":[[16,0,18,0],[19,0,21,0],[22,0,26,0],[27,0,29,0],[4,0,15,0],[0,3,0,4],[0,5,0,6],[1,0,2,0],[3,3,3,4],[3,5,3,6],[0,0,0,1]]}
["Notes:\n1.  27°C is limited to elevations of 900m or less\n2.  Quad Port IO Modules cannot be installed simultaneously with PCI Cards.\n3.  Processor - 135W - 4/6/8/16C, 120W-14C and 145W - 14/18C may have some performance impact.\n4.  Processors - There may be some performance impact during fan failures.\n5.  For A3/A4 individual PS selection:\n      1) For dual power supply configuration, power budget must fit within single power supply rated load and be installed in dual configuration, or\n      2) For single power supply configuration, power budget must be sized with 30% margin to single power supply rated load.\n6.  When identifying memory in the table, only Rank and Width are required.  Capacity is not required.\n7.  Processor limited to 90W to support 1.5W AOC cable. Processor limited to 90W and memory limited to DRx4 to support 2W AOC cable. \n8. Fan fail is not supported at A3/A4",null,"Base System SKUs:\nR2216TLP","Base System SKUs:\nR2312TLP",null,"Base System SKUs:\nR2224TLP"]
["ASHRAE (See note 1)","Classifications","A2","27C","A2","27C","A2"]
[null,"Max Ambient","35C","27C","35C","27C","35C","<-- See note 1"]
["PS (See note 5)","Power Supplies","See Note 5","See Note 5",null,"See Note 5"]
["EP Processors (See notes 3 and 4)","EP, 135w, 12C  (Intel® Xeon® processor E5-2690 V3)","3,4","3,4","3,4","3,4","3,4"]
[null,"EP, 120w, 12C  (Intel® Xeon® processor E5-2680 V3, E5-2670 V3)","3,4","3,4","3,4","3,4","3,4"]
[null,"EP, 105w, 10C  (Intel® Xeon® processor E5-2660 V3, E5-2650 V3)","3,4","3,4","3,4","3,4","3,4"]
[null,"EP, 90w, 8C (Intel® Xeon® processor E5-2640 V3)","3,4","3,4","3,4","3,4","3,4"]
[null,"EP, 85w,8C,6C (Intel® Xeon® processor E5-2630 V3, E5-2620 V3, E5-2609 V3, E5-2603 V3)","3,4","3,4","3,4","3,4","3,4"]
[null,"EP, 135w, 8C,6C,4C (Intel® Xeon® processor E5-2667 V3, E5-2643 V3, E5-2637 V3)","3,4","3,4",null,"3,4"]
[null,"EP, 105w, 4C (Intel® Xeon® processor E5-2623 V3)","3,4","3,4","3,4","3,4","3,4"]
[null,"EP, 65w, 12C  (Intel® Xeon® processor E5-2650L V3)","3,4","3,4","3,4","3,4","3,4"]
[null,"EP, 55w, 8C  (Intel® Xeon® processor E5-2630L V3)","3,4","3,4","3,4","3,4","3,4"]
[null,"EP, 145w, 14C,18C  (Intel® Xeon® processor E5-2697 V3, E5-2699 V3)","3,4","3,4",null,"3,4"]
[null,"EP, 135w, 16C  (Intel® Xeon® processor E5-2698 V3)","3,4","3,4",null,"3,4"]
[null,"EP, 120w, 14C (Intel® Xeon® processor E5-2695 V3, E5-2683 V3)","3,4","3,4",null,"3,4"]
["Memory Type (See note 6)","RDIMM-2Rx8,1Rx4","●","●","●","●","●"]
[null,"RDIMM-DRx4","●","●","●","●","●"]
[null,"LRDIMM-QRx4 DDP","●","●","●","●","●"]
["Add-in Cards (See note 2)","PCI Cards with 100LFM/55C spec","●"]
[null,"PCI Cards with 200LFM/55C spec"]
[null,"PCI Cards with 300LFM/55C spec",null,null,null,null,null,"<-- See note 2"]
["Module (See note 2)","AXX10GBTWLIOM - Dual 10GBASE-T IO Module ","●","●","●","●","●"]
[null,"AXX10GBNIAIOM - Dual SFP+ port 10GbE IO Module","●","●","●","●","●"]
[null,"AXX1FDRIBIOM - Single Port FDR Infiniband IO Module","●","●","●","●","●"]
[null,"AXX2FDRIBIOM - Dual Port FDR Infiniband IO Module","●","●","●","●","●"]
[null,"AXX4P1GBPWLIOM - Quad Port 1GbE IO Module","●","●","●","●","●","<-- See note 2"]
["QSFP Cables (See note 7)","Passive Cable","●","●","●","●","●"]
[null,"Active Optical Cable (1.5W)","●","●",7,"●",7]
[null,"Active Optical Cable (2W)","●","●",7,"●",7,"<-- See note 7"]

{"sheet":"Buchanan Pass_Normal","index":18,"n_rows":75,"n_cols":29,"rows_kept":75,"cut":false,"hidden":false,"merged":[[0,17,0,20],[0,21,0,24],[0,25,0,28],[3,17,3,20],[3,21,3,24],[3,25,3,28],[0,12,0,16],[1,0,2,0],[3,3,3,6],[3,7,3,11],[3,12,3,16],[0,7,0,11],[51,0,54,1],[70,0,72,1],[0,0,0,2],[0,3,0,6],[68,1,69,1],[62,0,65,0],[62,1,63,1],[64,1,65,1],[35,1,36,1],[58,0,60,1],[61,0,61,1],[55,0,57,1],[8,1,12,1],[37,1,41,1],[24,1,34,1],[73,0,74,1],[4,1,6,1],[66,0,69,0],[66,1,67,1],[13,1,20,1],[4,0,50,0],[43,1,49,1]]}
["Notes:\n1.  27°C is limited to elevations of 900m or less\n2.  Quad Port IO Modules cannot be installed simultaneously with PCI Cards.\n3.  Processors - may have significent performance impact.\n4.  Processors - There may be some performance impact.\n5.  Memory -  There may be some performance impact. FDHS is required \n6.  For A3/A4 individual PS selection:\n      1) For dual power supply configuration, power budget must fit within single power supply rated load and be installed in dual configuration\n      2) For single power supply configuration, power budget must be sized with 30% margin to single power supply rated load.\n7.  When identifying memory in the table, only Rank and Width are required.  Capacity is not required. FDHS required for 8Rx4 memory\n8.  Processor limited to 90W to support 1.5W AOC cable. Processor limited to 85W and memory limited to DRx4 to support 2W AOC cable. \n9. Supported with one HDD per node configuration.\n10. NVMe SSD IO throughput throttling is expected as configuration limitation.\n11. M.2 SSD drive is used for OS support only with light workload assuming 70% write, 30% read, 100% Random, 100% access, 8kb transfer rate, IO \"delay\" of 8. No fully stress mode is reuiqred.\n12. M.2 drives may see performance impact under heavy work load ",null,null,"Base System SKUs:\nHNS2204BP",null,null,null,"Base System SKUs:\nHNS2312BP",null,null,null,null,"Base System SKUs:\nHNS2224BP",null,null,null,null,"Base System SKUs:\nHNS2204BPLC",null,null,null,"Base System SKUs:\nHNS2312BPLC",null,null,null,"Base System SKUs:\nHNS2224BPLC"]
["ASHRAE (See note 1)",null,"Classifications","27C","A2","A3","A4","27C","A2","A2","A3","A4","27C","A2","A2","A3","A4","27C","A2","A3","A4","27C","A2","A3","A4","27C","A2","A3","A4"]
[null,null,"Max Ambient","27C","35C","40C","45C","27C","35C","35C","40C","45C","27C","35C","35C","40C","45C","27C","35C","40C","45C","27C","35C","40C","45C","27C","35C","40C","45C"]
["PS (See note 6)",null,"Power Supplies","See Note 6",null,null,null,"See Note 6",null,null,null,null,"See Note 6",null,null,null,null,"See Note 6",null,null,null,"See Note 6",null,null,null,"See Note 6"]
["Processors (See notes 3 and 4)","205 W","Intel® Xeon® Platinum 8280_28C"]
[null,null,"Intel® Xeon® Platinum 8270_26C"]
[null,null,"Intel® Xeon® Platinum 8268_24C"]
[null,"200 W","Intel® Xeon® Gold 6254_18C"]
[null,"165 W","Intel® Xeon® Platinum 8276_28C","●","●","3,4","3,4","●",null,"3,4","3,4",null,"●",null,"3,4","3,4",null,"●","●","●","●","●","●","●","●","●","●","●","●"]
[null,null,"Intel® Xeon® Platinum 8260_24C","●","●","3,4","3,4","●",null,"3,4","3,4",null,"●",null,"3,4","3,4",null,"●","●","●","●","●","●","●","●","●","●","●","●"]
[null,null,"Intel® Xeon® Platinum 8260Y_24/20/16C","●","●","3,4","3,4","●",null,"3,4","3,4",null,"●",null,"3,4","3,4",null,"●","●","●","●","●","●","●","●","●","●","●","●"]
[null,null,"Intel® Xeon® Gold 6246_12C","●","3,4",null,null,"3,4",null,null,null,null,"3,4",null,null,null,null,"●","●","●","●","●","●","●","●","●","●","●","●"]
[null,null,"Intel® Xeon® Gold 6212U_24C","●","●","3,4","3,4","●",null,"3,4","3,4",null,"●",null,"3,4","3,4",null,"●","●","●","●","●","●","●","●","●","●","●","●"]
[null,"150 W","Intel® Xeon® Gold 6252_24C","●","●","3,4","3,4","●",null,"3,4","3,4",null,"●",null,"3,4","3,4",null,"●","●","●","●","●","●","●","●","●","●","●","●"]
[null,null,"Intel® Xeon® Gold 6252N_24/8/16C","●","3,4",null,null,"3,4",null,null,null,null,"3,4",null,null,null,null,"●","●","●","●","●","●","●","●","●","●","●","●"]
[null,null,"Intel® Xeon® Gold 6248_20C","●","●","3,4","3,4","●",null,"3,4","3,4",null,"●",null,"3,4","3,4",null,"●","●","●","●","●","●","●","●","●","●","●","●"]
[null,null,"Intel® Xeon® Gold 6244_8C","●","3,4",null,null,"3,4",null,null,null,null,"3,4",null,null,null,null,"●","●","●","●","●","●","●","●","●","●","●","●"]
[null,null,"Intel® Xeon® Gold 6242_16C","●","●","3,4","3,4","●",null,"3,4","3,4",null,"●",null,"3,4","3,4",null,"●","●","●","●","●","●","●","●","●","●","●","●"]
[null,null,"Intel® Xeon® Gold 6240_18C","●","●","3,4","3,4","●",null,"3,4","3,4",null,"●",null,"3,4","3,4",null,"●","●","●","●","●","●","●","●","●","●","●","●"]
[null,null,"Intel® Xeon® Gold 6240Y_18/14/8C","●","3,4",null,null,"3,4",null,null,null,null,"3,4",null,null,null,null,"●","●","●","●","●","●","●","●","●","●","●","●"]
[null,null,"Intel® Xeon® Gold 6210U_20C","●","●","3,4","3,4","●",null,"3,4","3,4",null,"●",null,"3,4","3,4",null,"●","●","●","●","●","●","●","●","●","●","●","●"]
[null,"140 W","Intel® Xeon® Gold 6238_22C","●","●","●","3,4","●",null,"●","3,4","3,4","●",null,"●","3,4","3,4","●","●","●","●","●","●","●","●","●","●","●","●"]
[null,"135 W","Intel® Xeon® Gold 6262V_24C","●","●","●","3,4","●",null,"●","3,4","3,4","●",null,"●","3,4","3,4","●","●","●","●","●","●","●","●","●","●","●","●"]
[null,"130 W","Intel® Xeon® Gold 6234_8C","●","●","3,4","3,4","●",null,"3,4","3,4",null,"●",null,"3,4","3,4",null,"●","●","●","●","●","●","●","●","●","●","●","●"]
[null,"125 W","Intel® Xeon® Platinum 8253_16C","●","●","●","3,4","●",null,"●","3,4","3,4","●",null,"●","3,4","3,4","●","●","●","●","●","●","●","●","●","●","●","●"]
[null,null,"Intel® Xeon® Gold 6238T_22C","●","●","3,4","3,4","●",null,"3,4","3,4",null,"●",null,"3,4","3,4",null,"●","●","●","●","●","●","●","●","●","●","●","●"]
[null,null,"Intel® Xeon® Gold 6230_20C","●","●","●","3,4","●",null,"●","3,4","3,4","●",null,"●","3,4","3,4","●","●","●","●","●","●","●","●","●","●","●","●"]
[null,null,"Intel® Xeon® Gold 6230T_20C","●","●","3,4","3,4","●",null,"3,4","3,4",null,"●",null,"3,4","3,4",null,"●","●","●","●","●","●","●","●","●","●","●","●"]
[null,null,"Intel® Xeon® Gold 6230N_20/6/14C","●","●","3,4","3,4","●",null,"3,4","3,4",null,"●",null,"3,4","3,4",null,"●","●","●","●","●","●","●","●","●","●","●","●"]
[null,null,"Intel® Xeon® Gold 6226_12C","●","●","●","3,4","●",null,"●","3,4","3,4","●",null,"●","3,4","3,4","●","●","●","●","●","●","●","●","●","●","●","●"]
[null,null,"Intel® Xeon® Gold 6209U_20C","●","●","●","3,4","●",null,"●","3,4","3,4","●",null,"●","3,4","3,4","●","●","●","●","●","●","●","●","●","●","●","●"]
[null,null,"Intel® Xeon® Gold 5220_18C","●","●","●","3,4","●",null,"●","3,4","3,4","●",null,"●","3,4","3,4","●","●","●","●","●","●","●","●","●","●","●","●"]
[null,null,"Intel® Xeon® Gold 5220S_18C","●","●","●","3,4","●",null,"●","3,4","3,4","●",null,"●","3,4","3,4","●","●","●","●","●","●","●","●","●","●","●","●"]
[null,null,"Intel® Xeon® Gold 5218_16C","●","●","●","3,4","●",null,"●","3,4","3,4","●",null,"●","3,4","3,4","●","●","●","●","●","●","●","●","●","●","●","●"]
[null,null,"Intel® Xeon® Gold 5218B_16C","●","●","●","3,4","●",null,"●","3,4","3,4","●",null,"●","3,4","3,4","●","●","●","●","●","●","●","●","●","●","●","●"]
[null,"115 W","Intel® Xeon® Gold 6222V_20C","●","●","●","3,4","●",null,"●","3,4","3,4","●",null,"●","3,4","3,4","●","●","●","●","●","●","●","●","●","●","●","●"]
[null,null,"Intel® Xeon® Gold 5217_8C","●","●","3,4","3,4","●",null,"3,4","3,4",null,"●",null,"3,4","3,4",null,"●","●","●","●","●","●","●","●","●","●","●","●"]
[null,"105 W","Intel® Xeon® Platinum 8256_4C","●","●","3,4","3,4","●",null,"3,4","3,4",null,"●",null,"3,4","3,4",null,"●","●","●","●","●","●","●","●","●","●","●","●"]
[null,null,"Intel® Xeon® Gold 5222_4C","●","●","3,4","3,4","●",null,"3,4","3,4",null,"●",null,"3,4","3,4",null,"●","●","●","●","●","●","●","●","●","●","●","●"]
[null,null,"Intel® Xeon® Gold 5220T_18C","●","●","●","3,4","●",null,"●","3,4","3,4","●",null,"●","3,4","3,4","●","●","●","●","●","●","●","●","●","●","●","●"]
[null,null,"Intel® Xeon® Gold 5218N_16/4/12C","●","●","●","3,4","●",null,"●","3,4","3,4","●",null,"●","3,4","3,4","●","●","●","●","●","●","●","●","●","●","●","●"]
[null,null,"Intel® Xeon® Gold 5218T_16C","●","●","●","3,4","●",null,"●","3,4","3,4","●",null,"●","3,4","3,4","●","●","●","●","●","●","●","●","●","●","●","●"]
[null,"100 W","Intel® Xeon® Silver 4216_16C","●","●","●","3,4","●",null,"●","3,4","3,4","●",null,"●","3,4","3,4","●","●","●","●","●","●","●","●","●","●","●","●"]
[null,"85 W","Intel® Xeon® Gold 5215_10C","●","●","●","3,4","●","●",null,"3,4","3,4","●","●",null,"3,4","3,4","●","●","●","●","●","●","●","●","●","●","●","●"]
[null,null,"Intel® Xeon® Silver 4215_8C","●","●","●","3,4","●","●",null,"3,4","3,4","●","●",null,"3,4","3,4","●","●","●","●","●","●","●","●","●","●","●","●"]
[null,null,"Intel® Xeon® Silver 4214_12C","●","●","●","3,4","●","●",null,"3,4","3,4","●","●",null,"3,4","3,4","●","●","●","●","●","●","●","●","●","●","●","●"]
[null,null,"Intel® Xeon® Silver 4214Y_12/10/8C","●","●","●","3,4","●","●",null,"3,4","3,4","●","●",null,"3,4","3,4","●","●","●","●","●","●","●","●","●","●","●","●"]
[null,null,"Intel® Xeon® Silver 4210_10C","●","●","●","3,4","●","●",null,"3,4","3,4","●","●",null,"3,4","3,4","●","●","●","●","●","●","●","●","●","●","●","●"]
[null,null,"Intel® Xeon® Silver 4208_8C","●","●","●","3,4","●","●",null,"3,4","3,4","●","●",null,"3,4","3,4","●","●","●","●","●","●","●","●","●","●","●","●"]
[null,null,"Intel® Xeon® Bronze 3204_6C","●","●","●","3,4","●","●",null,"3,4","3,4","●","●",null,"3,4","3,4","●","●","●","●","●","●","●","●","●","●","●","●"]
[null,"70W","Intel® Xeon® Gold 4209T_8C","●","●","●","3,4","●","●",null,"3,4","3,4","●","●",null,"3,4","3,4","●","●","●","●","●","●","●","●","●","●","●","●"]
["Memory Type (See note 7)",null,"RDIMM-2Rx8,1Rx4","●","●","●","●","●","●","●","●","●","●","●","●","●","●","●","●","●","●","●","●","●","●","●","●","●","●"]
[null,null,"RDIMM-DRx4","●","●","●","●","●","●","●","●","●","●","●","●","●","●","●","●","●","●","●","●","●","●","●","●","●","●"]
[null,null,"LRDIMM-QRx4 DDP","●","●","●","●","●","●","●","●","●","●","●","●","●","●","●","●","●","●","●","●","●","●","●","●","●","●"]
[null,null,"LRDIMM-8Rx4 DDP","●","●",5,5,"●","●",5,5,5,"●","●",5,5,5,"●","●",5,5,"●","●",5,5,"●","●",5,5]
["AEP (See note 7)",null,"SDP 128G 15W","●","●",5,5,"●",5,5,null,null,"●",5,5,null,null,"●","●",5,5,"●",5,null,null,"●",5]
[null,null,"DDP 256G 18W","●",5,null,null,5,null,null,null,null,5,null,null,null,null,"●",5,null,null,5,5,null,null,5,5]
[null,null,"QDP 512G 18W","●",5,null,null,5,null,null,null,null,5,null,null,null,null,"●",5,null,null,5,5,null,null,5,5]
["Add-in Cards",null,"PCI Cards with 100LFM/55C spec","●","●","●","●","●","●","●","●","●","●","●","●","●","●","●","●","●","●","●","●","●","●","●","●","●","●"]
[null,null,"PCI Cards With 200LFM/55C spec","●","●","●","●",9,"●",9,null,null,9,"●",9,null,null,"●","●","●","●","●","●","●","●","●","●","●","●"]
[null,null,"PCI Cards With 300LFM/55C spec","●","●","●","●",null,9,null,null,null,null,9,null,null,null,"●","●","●","●","●","●","●","●","●","●","●","●"]
["Battery Backup (See note 9)",null,"Supercap (rated to 55C)","●","●","●","●","●","●","●","●","●","●","●","●","●","●","●","●","●","●","●","●","●","●","●","●","●","●"]
["2.5\" U.2 NVMe SSD","P3700/P3500","400GB/800GB",null,null,null,null,null,null,null,null,null,"●","●","●","●","●"]
[null,null,"1.6TB/2TB",null,null,null,null,null,null,null,null,null,"●","●","●","●","●"]
[null,"P4500/P4600","1TB/2TB/4TB",null,null,null,null,null,null,null,null,null,"●","●","●","●","●"]
[null,null,"1.6TB/2.0TB/3.2TB",null,null,null,null,null,null,null,null,null,"●","●","●","●","●"]
["PCIe AIC NVMe SSD","P3700/P3500","200GB/400GB","●","●","●","●","●","●","●",null,null,"●","●","●",null,null,"●","●","●","●","●","●","●","●","●","●","●","●"]
[null,null,"800GB/1.6TB/2TB","●","●","●",null,"●",null,null,null,null,"●",null,null,null,null,"●","●","●","●","●","●","●","●","●","●","●","●"]
[null,"P4500/P4600","2TB/","●","●","●","●","●","●","●",null,null,"●","●","●",null,null,"●","●","●","●","●","●","●","●","●","●","●","●"]
[null,null,"2TB/4TB","●","●","●","●","●","●","●",null,null,"●","●","●",null,null,"●","●","●","●","●","●","●","●","●","●","●","●"]
["QSFP Cables (See note 8)",null,"Passive Cable","●","●","●","●","●","●","●","●","●","●","●","●","●","●","●","●","●","●","●","●","●","●","●","●","●","●"]
[null,null,"Active Optical Cable (1.5W)","●","●",null,null,"●","●",8,null,null,"●","●",8,null,null,"●","●",null,null,"●","●",null,null,"●","●"]
[null,null,"Active Optical Cable (2W)",null,"●",null,null,null,"●",8,null,null,null,"●",8,null,null,"●","●",null,null,"●","●",null,null,"●","●"]
["M.2 SSD(See note 11)",null,"PCIe M.2 ","●",12,12,12,"●",12,12,12,12,"●",12,12,12,12,"●","●",12,12,"●","●",12,12,"●","●",12,12]
[null,null,"SATA M.2","●","●",12,12,"●",12,12,12,12,"●",12,12,12,12,"●","●",12,12,"●","●",12,12,"●","●",12,12]

{"sheet":"Buchanan Pass_Fan Fail","index":19,"n_rows":75,"n_cols":27,"rows_kept":75,"cut":false,"hidden":false,"merged":[[0,19,0,22],[0,23,0,26],[3,15,3,18],[3,7,3,10],[3,11,3,14],[3,19,3,22],[3,23,3,26],[0,7,0,10],[0,11,0,14],[0,15,0,18],[0,3,0,6],[1,0,2,0],[3,3,3,6],[35,1,36,1],[0,0,0,2],[8,1,12,1],[24,1,34,1],[4,1,6,1],[13,1,20,1],[43,1,49,1],[37,1,41,1],[4,0,50,0],[70,0,72,1],[73,0,74,1],[51,0,54,1],[58,0,60,1],[61,0,61,1],[64,1,65,1],[66,0,69,0],[66,1,67,1],[68,1,69,1],[62,1,63,1],[62,0,65,0],[55,0,57,1]]}
["Notes:\n1.  27°C is limited to elevations of 900m or less\n2.  Quad Port IO Modules cannot be installed simultaneously with PCI Cards.\n3.  Processors - may have significent performance impact.\n4.  Processors - There may be some performance impact.\n5.  Memory -  There may be some performance impact. FDHS is required \n6.  For A3/A4 individual PS selection:\n      1) For dual power supply configuration, power budget must fit within single power supply rated load and be installed in dual configuration\n      2) For single power supply configuration, power budget must be sized with 30% margin to single power supply rated load.\n7.  When identifying memory in the table, only Rank and Width are required.  Capacity is not required. FDHS required for 8Rx4 memory\n8.  Processor limited to 90W to support 1.5W AOC cable. Processor limited to 85W and memory limited to DRx4 to support 2W AOC cable. \n9. Supported with one HDD per node configuration.\n10. NVMe SSD IO throughput throttling is expected as configuration limitation.\n11. M.2 SSD drive is used for OS support only with light workload assuming 70% write, 30% read, 100% Random, 100% access, 8kb transfer rate, IO \"delay\" of 8. No fully stress mode is reuiqred.\n12. M.2 drives may see performance impact under heavy work load ",null,null,"Base System SKUs:\nH2204BNP",null,null,null,"Base System SKUs:\nH2312BNP",null,null,null,"Base System SKUs:\nH2224BNP",null,null,null,"Base System SKUs:\nHNS2204BPLC",null,null,null,"Base System SKUs:\nHNS2312BPLC",null,null,null,"Base System SKUs:\nHNS2224BPLC"]
["ASHRAE (See note 1)",null,"Classifications","27C","A2","A3","A4","27C","A2","A3","A4","27C","A2","A3","A4","27C","A2","A3","A4","27C","A2","A3","A4","27C","A2","A3","A4"]
[null,null,"Max Ambient","27C","35C","40C","45C","27C","35C","40C","45C","27C","35C","40C","45C","27C","35C","40C","45C","27C","35C","40C","45C","27C","35C","40C","45C"]
["PS (See note 5)",null,"Power Supplies","See Note 6",null,null,null,"See Note 6",null,null,null,"See Note 6",null,null,null,"See Note 6",null,null,null,"See Note 6",null,null,null,"See Note 6"]
["Processors (See notes 3 and 4)","205 W","Intel® Xeon® Platinum 8280_28C"]
[null,null,"Intel® Xeon® Platinum 8270_26C"]
[null,null,"Intel® Xeon® Platinum 8268_24C"]
[null,"200 W","Intel® Xeon® Gold 6254_18C"]
[null,"165 W","Intel® Xeon® Platinum 8276_28C","●","3,4",null,null,"3,4",null,null,null,"3,4",null,null,null,"●","●",null,null,"●","●",null,null,"●","●"]
[null,null,"Intel® Xeon® Platinum 8260_24C","●","3,4",null,null,"3,4",null,null,null,"3,4",null,null,null,"●","●",null,null,"●","●",null,null,"●","●"]
[null,null,"Intel® Xeon® Platinum 8260Y_24/20/16C","●","3,4",null,null,"3,4",null,null,null,"3,4",null,null,null,"●","●",null,null,"●","●",null,null,"●","●"]
[null,null,"Intel® Xeon® Gold 6246_12C","3,4",null,null,null,null,null,null,null,null,null,null,null,"●","●",null,null,"●","●",null,null,"●","●"]
[null,null,"Intel® Xeon® Gold 6212U_24C","●","3,4",null,null,"3,4",null,null,null,"3,4",null,null,null,"●","●",null,null,"●","●",null,null,"●","●"]
[null,"150 W","Intel® Xeon® Gold 6252_24C","●","3,4",null,null,"3,4",null,null,null,"3,4",null,null,null,"●","●",null,null,"●","●",null,null,"●","●"]
[null,null,"Intel® Xeon® Gold 6252N_24/8/16C","3,4",null,null,null,null,null,null,null,null,null,null,null,"●","●",null,null,"●","●",null,null,"●","●"]
[null,null,"Intel® Xeon® Gold 6248_20C","●","3,4",null,null,"3,4",null,null,null,"3,4",null,null,null,"●","●",null,null,"●","●",null,null,"●","●"]
[null,null,"Intel® Xeon® Gold 6244_8C","3,4",null,null,null,null,null,null,null,null,null,null,null,"●","●",null,null,"●","●",null,null,"●","●"]
[null,null,"Intel® Xeon® Gold 6242_16C","●","3,4",null,null,"3,4",null,null,null,"3,4",null,null,null,"●","●",null,null,"●","●",null,null,"●","●"]
[null,null,"Intel® Xeon® Gold 6240_18C","●","3,4",null,null,"3,4",null,null,null,"3,4",null,null,null,"●","●",null,null,"●","●",null,null,"●","●"]
[null,null,"Intel® Xeon® Gold 6240Y_18/14/8C","3,4",null,null,null,null,null,null,null,null,null,null,null,"●","●",null,null,"●","●",null,null,"●","●"]
[null,null,"Intel® Xeon® Gold 6210U_20C","●","3,4",null,null,"3,4",null,null,null,"3,4",null,null,null,"●","●",null,null,"●","●",null,null,"●","●"]
[null,"140 W","Intel® Xeon® Gold 6238_22C","●","3,4",null,null,"3,4","3,4",null,null,"3,4","3,4",null,null,"●","●",null,null,"●","●",null,null,"●","●"]
[null,"135 W","Intel® Xeon® Gold 6262V_24C","●","3,4",null,null,"3,4","3,4",null,null,"3,4","3,4",null,null,"●","●",null,null,"●","●",null,null,"●","●"]
[null,"130 W","Intel® Xeon® Gold 6234_8C","●","3,4",null,null,"3,4",null,null,null,"3,4",null,null,null,"●","●",null,null,"●","●",null,null,"●","●"]
[null,"125 W","Intel® Xeon® Platinum 8253_16C","●","3,4",null,null,"3,4","3,4",null,null,"3,4","3,4",null,null,"●","●",null,null,"●","●",null,null,"●","●"]
[null,null,"Intel® Xeon® Gold 6238T_22C","●","3,4",null,null,"3,4",null,null,null,"3,4",null,null,null,"●","●",null,null,"●","●",null,null,"●","●"]
[null,null,"Intel® Xeon® Gold 6230_20C","●","3,4",null,null,"3,4","3,4",null,null,"3,4","3,4",null,null,"●","●",null,null,"●","●",null,null,"●","●"]
[null,null,"Intel® Xeon® Gold 6230T_20C","●","3,4",null,null,"3,4",null,null,null,"3,4",null,null,null,"●","●",null,null,"●","●",null,null,"●","●"]
[null,null,"Intel® Xeon® Gold 6230N_20/6/14C","●","3,4",null,null,"3,4",null,null,null,"3,4",null,null,null,"●","●",null,null,"●","●",null,null,"●","●"]
[null,null,"Intel® Xeon® Gold 6226_12C","●","3,4",null,null,"3,4","3,4",null,null,"3,4","3,4",null,null,"●","●",null,null,"●","●",null,null,"●","●"]
[null,null,"Intel® Xeon® Gold 6209U_20C","●","3,4",null,null,"3,4","3,4",null,null,"3,4","3,4",null,null,"●","●",null,null,"●","●",null,null,"●","●"]
[null,null,"Intel® Xeon® Gold 5220_18C","●","3,4",null,null,"3,4","3,4",null,null,"3,4","3,4",null,null,"●","●",null,null,"●","●",null,null,"●","●"]
[null,null,"Intel® Xeon® Gold 5220S_18C","●","3,4",null,null,"3,4","3,4",null,null,"3,4","3,4",null,null,"●","●",null,null,"●","●",null,null,"●","●"]
[null,null,"Intel® Xeon® Gold 5218_16C","●","3,4",null,null,"3,4","3,4",null,null,"3,4","3,4",null,null,"●","●",null,null,"●","●",null,null,"●","●"]
[null,null,"Intel® Xeon® Gold 5218B_16C","●","3,4",null,null,"3,4","3,4",null,null,"3,4","3,4",null,null,"●","●",null,null,"●","●",null,null,"●","●"]
[null,"115 W","Intel® Xeon® Gold 6222V_20C","●","3,4",null,null,"3,4","3,4",null,null,"3,4","3,4",null,null,"●","●",null,null,"●","●",null,null,"●","●"]
[null,null,"Intel® Xeon® Gold 5217_8C","●","3,4",null,null,"3,4",null,null,null,"3,4",null,null,null,"●","●",null,null,"●","●",null,null,"●","●"]
[null,"105 W","Intel® Xeon® Platinum 8256_4C","●","3,4",null,null,"3,4",null,null,null,"3,4",null,null,null,"●","●",null,null,"●","●",null,null,"●","●"]
[null,null,"Intel® Xeon® Gold 5222_4C","●","3,4",null,null,"3,4",null,null,null,"3,4",null,null,null,"●","●",null,null,"●","●",null,null,"●","●"]
[null,null,"Intel® Xeon® Gold 5220T_18C","●","3,4",null,null,"3,4","3,4",null,null,"3,4","3,4",null,null,"●","●",null,null,"●","●",null,null,"●","●"]
[null,null,"Intel® Xeon® Gold 5218N_16/4/12C","●","3,4",null,null,"3,4","3,4",null,null,"3,4","3,4",null,null,"●","●",null,null,"●","●",null,null,"●","●"]
[null,null,"Intel® Xeon® Gold 5218T_16C","●","3,4",null,null,"3,4","3,4",null,null,"3,4","3,4",null,null,"●","●",null,null,"●","●",null,null,"●","●"]
[null,"100 W","Intel® Xeon® Silver 4216_16C","●","3,4",null,null,"3,4","3,4",null,null,"3,4","3,4",null,null,"●","●",null,null,"●","●",null,null,"●","●"]
[null,"85 W","Intel® Xeon® Gold 5215_10C","●","3,4",null,null,"3,4","3,4",null,null,"3,4","3,4",null,null,"●","●",null,null,"●","●",null,null,"●","●"]
[null,null,"Intel® Xeon® Silver 4215_8C","●","3,4",null,null,"3,4","3,4",null,null,"3,4","3,4",null,null,"●","●",null,null,"●","●",null,null,"●","●"]
[null,null,"Intel® Xeon® Silver 4214_12C","●","3,4",null,null,"3,4","3,4",null,null,"3,4","3,4",null,null,"●","●",null,null,"●","●",null,null,"●","●"]
[null,null,"Intel® Xeon® Silver 4214Y_12/10/8C","●","3,4",null,null,"3,4","3,4",null,null,"3,4","3,4",null,null,"●","●",null,null,"●","●",null,null,"●","●"]
[null,null,"Intel® Xeon® Silver 4210_10C","●","3,4",null,null,"3,4","3,4",null,null,"3,4","3,4",null,null,"●","●",null,null,"●","●",null,null,"●","●"]
[null,null,"Intel® Xeon® Silver 4208_8C","●","3,4",null,null,"3,4","3,4",null,null,"3,4","3,4",null,null,"●","●",null,null,"●","●",null,null,"●","●"]
[null,null,"Intel® Xeon® Bronze 3204_6C","●","3,4",null,null,"3,4","3,4",null,null,"3,4","3,4",null,null,"●","●",null,null,"●","●",null,null,"●","●"]
[null,"70W","Intel® Xeon® Gold 4209T_8C","●","3,4",null,null,"3,4","3,4",null,null,"3,4","3,4",null,null,"●","●",null,null,"●","●",null,null,"●","●"]
["Memory Type (See note 7)",null,"RDIMM-2Rx8,1Rx4","●","●",null,null,"●","●",null,null,"●","●",null,null,"●","●",null,null,"●","●",null,null,"●","●"]
[null,null,"RDIMM-DRx4","●","●",null,null,"●","●",null,null,"●","●",null,null,"●","●",null,null,"●","●",null,null,"●","●"]
[null,null,"LRDIMM-QRx4 DDP","●","●",null,null,"●","●",null,null,"●","●",null,null,"●","●",null,null,"●","●",null,null,"●","●"]
[null,null,"LRDIMM-8Rx4 DDP","●","●",null,null,"●",5,null,null,"●",5,null,null,"●","●",null,null,"●",5,null,null,"●",5]
["AEP (See note 7)",null,"SDP 128G 15W","●",5,null,null,"●",5,null,null,"●",5,null,null,"●",5,null,null,"●",5,null,null,"●",5]
[null,null,"DDP 256G 18W","●",5,null,null,5,null,null,null,5,null,null,null,"●",5,null,null,5,null,null,null,5]
[null,null,"QDP 512G 18W","●",5,null,null,5,null,null,null,5,null,null,null,"●",5,null,null,5,null,null,null,5]
["Add-in Cards",null,"PCI Cards with 100LFM/55C spec","●","●",null,null,"●","●",null,null,"●","●",null,null,"●","●",null,null,"●","●",null,null,"●","●"]
[null,null,"PCI Cards With 200LFM/55C spec","●",2,null,null,2,2,null,null,2,2,null,null,"●","●",null,null,"●","●",null,null,"●","●"]
[null,null,"PCI Cards With 300LFM/55C spec",null,null,null,null,null,null,null,null,null,null,null,null,"●","●",null,null,"●","●",null,null,"●","●"]
["Battery Backup (See note 9)",null,"Supercap (rated to 55C)","●","●",null,null,"●","●",null,null,"●","●",null,null,"●","●",null,null,"●","●",null,null,"●","●"]
["2.5\" U.2 NVMe SSD","P3700/P3500","400GB/800GB",null,null,null,null,null,null,null,null,"●","●"]
[null,null,"1.6TB/2TB",null,null,null,null,null,null,null,null,"●","●"]
[null,"P4500/P4600","1TB/2TB/4TB",null,null,null,null,null,null,null,null,"●","●"]
[null,null,"1.6TB/2.0TB/3.2TB",null,null,null,null,null,null,null,null,"●","●"]
["PCIe AIC NVMe SSD","P3700/P3500","200GB/400GB","●","●",null,null,"●",10,null,null,"●",10,null,null,"●","●",null,null,"●","●",null,null,"●","●"]
[null,null,"800GB/1.6TB/2TB","●",10,null,null,10,null,null,null,10,null,null,null,"●","●",null,null,"●","●",null,null,"●","●"]
[null,"P4500/P4600","2TB/","●","●",null,null,"●",10,null,null,"●",10,null,null,"●","●",null,null,"●","●",null,null,"●","●"]
[null,null,"2TB/4TB","●","●",null,null,"●",10,null,null,"●",10,null,null,"●","●",null,null,"●","●",null,null,"●","●"]
["QSFP Cables (See note 8)",null,"Passive Cable","●","●",null,null,"●","●",null,null,"●","●",null,null,"●","●",null,null,"●","●",null,null,"●","●"]
[null,null,"Active Optical Cable (1.5W)","●","●",null,null,"●",8,null,null,"●",8,null,null,"●","●",null,null,"●","●",null,null,"●","●"]
[null,null,"Active Optical Cable (2W)",null,"●",null,null,null,8,null,null,null,8,null,null,"●","●",null,null,"●","●",null,null,"●","●"]
["M.2 SSD(See note 10)",null,"PCIe M.2 ","●",12,null,null,"●",12,null,null,"●",12,null,null,"●","●",null,null,"●","●",null,null,"●","●"]
[null,null,"SATA M.2","●",12,null,null,"●",12,null,null,"●",12,null,null,"●","●",null,null,"●","●",null,null,"●","●"]

{"sheet":"Revision","index":20,"n_rows":5,"n_cols":4,"rows_kept":5,"cut":false,"hidden":false,"merged":[]}
[{"$f":"MAX(A4:A24)","v":"2019-04-15"},{"$f":"MAX(B4:B24)","v":1},null,"<=== Linked to Summary Tab."]
[]
["Date","Rev","Notes","Init"]
["2019-04-01",0.6,"Initial Release.","Zhaomin Cheng"]
["2019-04-15",1,"Update CPU/DIMM;Update the thermal matrix with updated format","Zhaomin Cheng"]

{"sheet":"Macro1","index":21,"n_rows":0,"n_cols":0,"rows_kept":0,"cut":false,"hidden":false,"merged":[]}